{"text_format":"1","workbook":"xlsx","n_sheets":20,"sheets":["Admin","Summary Exec","Data","Calc","Summary LA","1. LA - Leadership","2. LA - Joint Arrangements","3. LA - Commissioning","4. LA - EHC Plan","5. LA - Co-Production","6. LA - Monitor & Redress","LA - mapping","Summary CCG","1. Leadership","2. Joint Arrangements","3. Commissioning","4. EHC Plan","5. Engagement ","6. Monitoring & Redress","Code Lists"],"not_rendered":{"charts":35,"images":6,"macros":1,"external_links":1,"defined_names":3,"comments":0,"pivot_tables":0},"unopened":[],"bounds":{"document_bytes":16777216,"sheet_cells":100000,"rows_first":2000,"rows_last":500,"rows_between":2000,"halvings":0,"cell_chars":16384,"cell_head_chars":4096},"cells_cut":0,"cells_raw":0,"read":"whole","date_system":"1900"}

{"sheet":"Admin","index":0,"n_rows":3,"n_cols":13,"rows_kept":3,"cut":false,"hidden":false,"merged":[]}
[]
[null,null,null,null,null,null,null,null,null,null,null,null,14672257]
[null,null,null,null,null,null,null,null,null,null,null,null,10066176]

{"sheet":"Summary Exec","index":1,"n_rows":56,"n_cols":16,"rows_kept":56,"cut":false,"hidden":false,"merged":[[1,3,1,17]]}
[]
[null,null,null,"Local Area Overview: Progress on Joint Working to Improve Outcomes for Children and Young People with SEN and Disability"]
[]
[]
[]
[null,null,null,"TOTAL NUMBER OF RESPONSES:",null,null,null,{"$f":"Calc!D74","v":374}]
{"$rows_left_out":51}
{"sheet":"Data","index":2,"n_rows":188,"n_cols":10,"rows_kept":188,"cut":false,"hidden":true,"merged":[]}
["Type","Section","Section_ID","Sub-Section","SS_ID","Q","Audit1","Audit2","Audit1_Score","Audit2_Score"]
["CCG","1. Leadership",1,"Senior / executive leadership for SEND in the CCG",1.1000000000000001,1,{"$f":"'1. Leadership'!D8","v":"Please select"},{"$f":"'1. Leadership'!E8","v":"Please select"},{"$f":"VLOOKUP(G2,'Code Lists'!$C$3:$D$6,2,0)","v":0},{"$f":"VLOOKUP(H2,'Code Lists'!$C$3:$D$6,2,0)","v":0}]
["CCG","1. Leadership",1,"Senior / executive leadership for SEND in the CCG",1.1000000000000001,2,{"$f":"'1. Leadership'!D9","v":"Please select"},{"$f":"'1. Leadership'!E9","v":"Please select"},{"$f":"VLOOKUP(G3,'Code Lists'!$C$3:$D$6,2,0)","v":0},{"$f":"VLOOKUP(H3,'Code Lists'!$C$3:$D$6,2,0)","v":0}]
["CCG","1. Leadership",1,"Senior / executive leadership for SEND in the CCG",1.1000000000000001,3,{"$f":"'1. Leadership'!D10","v":"Please select"},{"$f":"'1. Leadership'!E10","v":"Please select"},{"$f":"VLOOKUP(G4,'Code Lists'!$C$3:$D$6,2,0)","v":0},{"$f":"VLOOKUP(H4,'Code Lists'!$C$3:$D$6,2,0)","v":0}]
["CCG","1. Leadership",1,"Senior / executive leadership for SEND in the CCG",1.1000000000000001,4,{"$f":"'1. Leadership'!D11","v":"Please select"},{"$f":"'1. Leadership'!E11","v":"Please select"},{"$f":"VLOOKUP(G5,'Code Lists'!$C$3:$D$6,2,0)","v":0},{"$f":"VLOOKUP(H5,'Code Lists'!$C$3:$D$6,2,0)","v":0}]
["CCG","1. Leadership",1,"Senior / executive leadership for SEND in the CCG",1.1000000000000001,5,{"$f":"'1. Leadership'!D12","v":"Please select"},{"$f":"'1. Leadership'!E12","v":"Please select"},{"$f":"VLOOKUP(G6,'Code Lists'!$C$3:$D$6,2,0)","v":0},{"$f":"VLOOKUP(H6,'Code Lists'!$C$3:$D$6,2,0)","v":0}]
{"$rows_left_out":183}
{"sheet":"Calc","index":3,"n_rows":92,"n_cols":23,"rows_kept":92,"cut":false,"hidden":true,"merged":[]}
[]
[]
[null,null,"CCG",null,"1st AUDIT: SCORE",null,null,null,"1st AUDIT: PERCENTAGE",null,null,null,null,null,"2nd AUDIT: SCORE",null,null,null,"2nd AUDIT: PERCENTAGE"]
[null,null,null,null,3,2,1,0,null,null,null,null,null,null,3,2,1,0]
[null,"Section_ID","Sub-Section","No of Qs","Green","Amber","Red","No Response","No Compliance","Partial Compliance","Full Compliance","No Response","Validation",null,"Green","Amber","Red","No Response","No Compliance","Partial Compliance","Full Compliance","No Response","Validation"]
[null,{"$f":"INDEX(Data!$C$1:$C$75,MATCH(Calc!C6,Data!$D$1:$D$75,0))","v":1},"Senior / executive leadership for SEND in the CCG",{"$f":"COUNTIFS(Data!$A:$A,\"CCG\",Data!$C:$C,Calc!$B6,Data!$D:$D,Calc!$C6)","v":7},{"$f":"COUNTIFS(Data!$A:$A,\"CCG\",Data!$C:$C,Calc!$B6,Data!$D:$D,Calc!$C6,Data!$I:$I,Calc!E$4)","v":0},{"$f":"COUNTIFS(Data!$A:$A,\"CCG\",Data!$C:$C,Calc!$B6,Data!$D:$D,Calc!$C6,Data!$I:$I,Calc!F$4)","v":0},{"$f":"COUNTIFS(Data!$A:$A,\"CCG\",Data!$C:$C,Calc!$B6,Data!$D:$D,Calc!$C6,Data!$I:$I,Calc!G$4)","v":0},{"$f":"COUNTIFS(Data!$A:$A,\"CCG\",Data!$C:$C,Calc!$B6,Data!$D:$D,Calc!$C6,Data!$I:$I,Calc!H$4)","v":7},{"$f":"G6/$D6","v":0},{"$f":"F6/$D6","v":0},{"$f":"E6/$D6","v":0},{"$f":"H6/$D6","v":1},{"$f":"SUM(I6:L6)","v":1},null,{"$f":"COUNTIFS(Data!$A:$A,\"CCG\",Data!$C:$C,Calc!$B6,Data!$D:$D,Calc!$C6,Data!$J:$J,Calc!O$4)","v":0},{"$f":"COUNTIFS(Data!$A:$A,\"CCG\",Data!$C:$C,Calc!$B6,Data!$D:$D,Calc!$C6,Data!$J:$J,Calc!P$4)","v":0},{"$f":"COUNTIFS(Data!$A:$A,\"CCG\",Data!$C:$C,Calc!$B6,Data!$D:$D,Calc!$C6,Data!$J:$J,Calc!Q$4)","v":0},{"$f":"COUNTIFS(Data!$A:$A,\"CCG\",Data!$C:$C,Calc!$B6,Data!$D:$D,Calc!$C6,Data!$J:$J,Calc!R$4)","v":7},{"$f":"Q6/$D6","v":0},{"$f":"P6/$D6","v":0},{"$f":"O6/$D6","v":0},{"$f":"R6/$D6","v":1},{"$f":"SUM(S6:V6)","v":1}]
{"$rows_left_out":87}
{"sheet":"Summary LA","index":4,"n_rows":286,"n_cols":14,"rows_kept":286,"cut":false,"hidden":false,"merged":[[1,3,1,17],[4,8,4,10],[5,8,5,10]]}
[]
[null,null,null,"Special Educational Needs & Disability (SEND) Diagnostic Checklist for Local Authorities"]
[]
[]
[null,null,null,null,null,null,null,"REGION"]
[null,null,null,null,null,null,null,"LOCAL AUTHORITY"]
{"$rows_left_out":281}
{"sheet":"1. LA - Leadership","index":5,"n_rows":83,"n_cols":10,"rows_kept":83,"cut":false,"hidden":true,"merged":[[6,3,6,9],[35,3,35,9],[52,3,52,9],[72,3,72,9]]}
[]
[null,null,null,"1. LEADERSHIP"]
[]
[null,null,null,"Governance and Leadership"]
[]
[null,null,null,"Additional Notes (press '+' sign to expand)"]
{"$rows_left_out":78}
{"sheet":"2. LA - Joint Arrangements","index":6,"n_rows":119,"n_cols":10,"rows_kept":119,"cut":false,"hidden":true,"merged":[[85,3,85,9],[6,3,6,9],[38,3,38,9],[41,4,42,4],[65,3,65,9],[68,4,70,4]]}
[]
[null,null,null,"2. Joint Arrangements"]
[]
[null,null,null,"Working across the local authority and with health services"]
[]
[null,null,null,"Additional Notes (press '+' sign to expand)"]
{"$rows_left_out":114}
{"sheet":"3. LA - Commissioning","index":7,"n_rows":128,"n_cols":10,"rows_kept":128,"cut":false,"hidden":true,"merged":[[6,3,6,9],[32,3,32,9],[58,3,58,9],[84,3,84,9],[113,3,113,9]]}
[]
[null,null,null,"3. Commissioning"]
[]
[null,null,null,"Assessing Local Need"]
[]
[null,null,null,"Additional Notes (press '+' sign to expand)"]
{"$rows_left_out":123}
{"sheet":"4. LA - EHC Plan","index":8,"n_rows":86,"n_cols":10,"rows_kept":86,"cut":false,"hidden":true,"merged":[[6,3,6,9],[29,3,29,9],[59,3,59,9]]}
[]
[null,null,null,"4. Education, Health & Care Plan"]
[]
[null,null,null,"SEN Support and Early Help (Coordinated assessment) "]
[]
[null,null,null,"Additional Notes (press '+' sign to expand)"]
{"$rows_left_out":81}
{"sheet":"5. LA - Co-Production","index":9,"n_rows":52,"n_cols":10,"rows_kept":52,"cut":false,"hidden":true,"merged":[[6,3,6,9]]}
[]
[null,null,null,"5. Co-production (Engagement)"]
[]
[null,null,null,"Children, Young People and Parents"]
[]
[null,null,null,"Additional Notes (press '+' sign to expand)"]
{"$rows_left_out":47}
{"sheet":"6. LA - Monitor & Redress","index":10,"n_rows":93,"n_cols":10,"rows_kept":93,"cut":false,"hidden":true,"merged":[[6,3,6,9],[22,3,22,9],[62,3,62,9],[79,3,79,9]]}
[]
[null,null,null,"6. Monitoring & Redress"]
[]
[null,null,null,"Data to Monitor Progress"]
[]
[null,null,null,"Additional Notes (press '+' sign to expand)"]
{"$rows_left_out":88}
{"sheet":"LA - mapping","index":11,"n_rows":16,"n_cols":7,"rows_kept":16,"cut":false,"hidden":true,"merged":[]}
[]
[]
[]
[]
[null,"Audit 1 and 2 response","Mark",null,"Trend"]
[null,"Please Select",0,null,"Please select"]
{"$rows_left_out":11}
{"sheet":"Summary CCG","index":12,"n_rows":61,"n_cols":9,"rows_kept":61,"cut":false,"hidden":false,"merged":[[53,0,55,0],[53,2,53,4],[53,6,53,8],[54,2,55,2],[54,3,55,3],[54,4,55,4],[54,6,55,6],[54,7,55,7],[54,8,55,8],[47,0,49,0],[47,2,47,4],[47,6,47,8],[48,2,49,2],[48,3,49,3],[48,4,49,4],[48,6,49,6],[48,7,49,7],[48,8,49,8],[40,0,42,0],[40,2,40,4],[40,6,40,8],[41,2,42,2],[41,3,42,3],[41,4,42,4],[41,6,42,6],[41,7,42,7],[41,8,42,8],[30,0,32,0],[30,2,30,4],[30,6,30,8],[31,2,32,2],[31,3,32,3],[31,4,32,4],[31,6,32,6],[31,7,32,7],[31,8,32,8],[21,0,23,0],[21,2,21,4],[21,6,21,8],[22,2,23,2],[22,3,23,3],[22,4,23,4],[22,6,23,6],[22,7,23,7],[22,8,23,8],[8,0,10,0],[8,2,8,4],[8,6,8,8],[12,0,14,0],[12,2,12,4],[12,6,12,8],[13,2,14,2],[13,3,14,3],[13,4,14,4],[13,6,14,6],[13,7,14,7],[13,8,14,8],[1,0,1,8],[3,1,3,3],[5,2,5,4],[5,6,5,8],[6,2,6,4],[6,6,6,8]]}
[]
["Special Educational Needs & Disability (SEND) Diagnostic Checklist for CCGs "]
[]
["CLINICAL COMMISSIONING GROUP:"]
[]
[null,null,"1st Audit ",null,null,null,"2nd Audit "]
{"$rows_left_out":56}
{"sheet":"1. Leadership","index":13,"n_rows":69,"n_cols":7,"rows_kept":69,"cut":false,"hidden":true,"merged":[[47,0,47,6],[48,0,48,6],[49,0,49,6],[51,1,52,1],[55,0,57,1],[55,5,57,5],[55,6,57,6],[44,0,46,1],[44,5,46,5],[44,6,46,6],[24,0,24,6],[25,0,25,6],[32,0,34,1],[32,5,34,5],[32,6,34,6],[35,0,35,6],[36,0,36,6],[37,0,37,6],[38,0,38,6],[40,1,41,1],[42,1,43,1],[23,0,23,6],[1,0,1,6],[4,0,4,6],[5,0,5,6],[14,5,16,5],[14,6,16,6],[17,0,17,6],[18,0,18,6],[19,0,19,6],[20,0,20,6],[21,0,21,6],[22,0,22,6]]}
[]
["1. LEADERSHIP"]
[]
[]
["Senior / executive leadership for SEND in the CCG"]
["The CCG governing body (or other executive arrangements) should oversee the joint arrangements for SEND, and the contribution of health and ensure a clear line of accountability.The CCG is subject to a number of statutory duties, and the decisions made by the professionals working for the providers from whom it commissions services may have significant cost implications. CCGs will want therefore to ensure there is appropriate leadership and governance arrangements in place. Senior leadership support will be required to secure strategic partnership arrangements with local authorities. The CCG has to be part of joint arrangements; contributing to the published Local Offer of services for children and young people with SEND, and securing input from provider servcies. A senior champion in the CCG would help to ensure the needs of children and young people with SEND or complex needs are being considered and ensure adequate oversight.                            "]
{"$rows_left_out":64}
{"sheet":"2. Joint Arrangements","index":14,"n_rows":55,"n_cols":7,"rows_kept":55,"cut":false,"hidden":true,"merged":[[48,0,48,6],[49,0,49,6],[37,0,37,6],[38,0,38,6],[39,0,39,6],[40,0,40,6],[42,1,44,1],[45,0,47,1],[34,0,36,1],[34,5,36,5],[34,6,36,6],[16,0,16,6],[17,0,17,6],[18,0,18,6],[19,0,19,6],[21,1,22,1],[23,0,25,1],[26,0,26,6],[27,0,27,6],[28,0,28,6],[29,0,29,6],[31,1,33,1],[1,0,1,6],[4,0,4,6],[5,0,5,6],[13,0,15,1],[13,5,15,5],[13,6,15,6]]}
[]
["2. Joint Arrangements"]
[]
[]
["Working with the local authority"]
["Any formal agreements should be signed-off at executive / Governing body level in the CCG (depending on how the executive function is exercised).  There will be lower-level elements of joint working which fall within the delegated authority of the CCG officer. Even then, the CCG would need to ensure it had sufficient oversight to assure itself that it was fulfilling its statutory obligations. \n\nFormal section 75 agreements or other formal arrangements are not mandatory, however, many local areas find that once set up they provide a more efficient and streamlined approach to the allocation of resources.  The new statutory framework requires CCGs and local authorities to agree joint arrangements, focused on the assessment and planning of an individual Education, Health and Care plan for each child with special educational needs.  \nThe joint arrangements are also intended to provide a basis for integrated working to support children with SEND who are not eligible for an EHC plan.  The CCG and local authority should agree a reasonable set of arrangements for how they manage their day-to-day interactions.  A written agreement is recommended, to ensure parties to the agreement have a common point of reference (dispute resolution in particular will need to refer to the original terms of the joint arrangements).\n\nCCGs and health providers are likely to have to work with more than one local authority, each with their own approach and EHC plan format. Each local authority will have to meet the same statutory requirements, and each EHC plan has to have the same sections. These provide a basis for the CCG and providers to take a consistent approach to each local authority; areeing with providers on an approach for their contributions to plans, which individual local authorities would incorporate. A  consistent template or methodology could be used for interaction with each local authority, and codified as part of the joint arrangements. \n\nThe local authority has the lead in implementing the new SEND framework locally, but there has to be partnership working in developing joint arrangements which both parties can support. Ensuring the robustness of arrangements cannot be undertaken by local authorities and CCGs in silos; the arrangements are designed to develop integrated approaches, and should be assessed in an integrated way. The CCG need to work with partners in assessing local demand, and promoting SEND within local health and care strategies. \n\nIf the local authority cannot work with the CCG, then this will impact significantly on its ability to deliver effective services for children and young people with SEND. Another local authority or CCG might be able to provide peer support or arbitrate where there is a significant disagreement.\n                                "]
{"$rows_left_out":50}
{"sheet":"3. Commissioning","index":15,"n_rows":59,"n_cols":7,"rows_kept":59,"cut":false,"hidden":true,"merged":[[52,0,52,6],[44,0,44,6],[45,0,45,6],[48,0,50,1],[48,5,50,5],[48,6,50,6],[51,0,51,6],[43,0,43,6],[27,0,27,6],[31,0,33,1],[31,5,33,5],[31,6,33,6],[34,0,34,6],[35,0,35,6],[37,1,38,1],[39,0,41,1],[39,5,41,5],[39,6,41,6],[42,0,42,6],[26,0,26,6],[1,0,1,6],[4,0,4,6],[5,0,5,6],[12,0,14,1],[12,5,14,5],[12,6,14,6],[15,0,15,6],[16,0,16,6],[18,0,18,6],[19,0,19,6],[22,0,24,1]]}
[]
["3. Commissioning"]
[]
[]
["Assessing local need"]
["CCG (or partners, such as Public Health) can determine demand based on: \n• Child and Maternal Health Intelligence Service (CHIMAT) Needs Assessment Report - Children and young people with disabilities http://www.chimat.org.uk/disability; \n• GP practice QOF registers of learning disability; \n• provider contracts / historic demand; \n• local authority registers of disability. \n• national prevalence data on key conditions; \n• engagement with Parent Carer Forums; other engagement with children, young people and families. \n• feedback from GP practice members, and from commissioned providers. \n\nThe local authority should maintain as a statutory duty a register of people with a learning disability; GP practices, to quality for Quality and Outcome Framework points should establish and maintain a register of patients with learning disabilities (ID LD003). The provider perspective on the scope of current provision is essential. \n\nCCGs have to ensure that their commissioning plans are appropriate to meet local demand, and to ensure they have an effective relationship with the key providers to ensure the joint arrangements are delivering completed and implemented EHC plans.\n\nServices for children with special educational needs could include a wide range of support, including speech and language therapy, assistive technology, children’s mental health services, occupational therapy, habilitation training, physiotherapy, specialist equipment, wheelchairs and continence supplies.\n\nWhere applicable, CCGs should work with neighbouring areas (LAs, CCGs and providers) to identify synergies and where provision can be improved by working across boundaries."]
{"$rows_left_out":54}
{"sheet":"4. EHC Plan","index":16,"n_rows":31,"n_cols":7,"rows_kept":31,"cut":false,"hidden":true,"merged":[[26,0,26,6],[16,0,16,6],[17,0,17,6],[22,0,24,1],[22,5,24,5],[22,6,24,6],[25,0,25,6],[12,0,14,1],[12,5,14,5],[12,6,14,6],[1,0,1,6],[4,0,4,6],[5,0,5,6],[7,1,8,1],[9,1,10,1]]}
[]
["4. Education, Health & Care Plan"]
[]
[]
["Coordinated Assessment"]
["The Education, Health and Care plan is a key focus for the new SEND arrangements. The plan is a statutory document, which captures: \n\n• the child or young person’s special educational needs and any health and social care needs;\n• the services which the relevant commissioners intend to secure; \n• the outcomes which they will aim to deliver, based on the child or young person’s needs and aspirations.\n\nIf the plan specifies health care provision, the responsible commissioning body – usually the CCG - must arrange the specified health care provision for the child or young person.\n\nThere is no easy answer to the issue of capacity constraints. It is vital that the CCG talks to the local authority, so that the EHC process is not held up for a diagnosis which may take months – and a methodology can be agreed for allowing for pending assessments, and for reviews following an assessment.\n\nThere will be cases where a child or young person has been discharged from a clinic but where a programme of care advised by the clinic is being followed.  In such instances it is important that this programme of care is provided to the local authority as the health advice, rather than the information that the child has been discharged, and it is important that the CCG ensures that providers understand this.   There will also be cases where a child is not known to clinical services but where it has been identified that there is a health need.  In such instances CCGs will wish to consider a process which supports the timetable for completion of the plan.   Some areas are holding spare appointments whilst others are including a health assessment as an action for the EHC plan. \n\nWhere a child does have a special educational need arising from a significant health issue, their health needs must be captured in the EHC plan, along with the services required to help deliver improved outcomes for them. It may be the case that the CCG would not need to commission any service which wasn’t already being secured, but they must ensure that their health needs are adequately covered by the EHC assessment and planning process.\n"]
{"$rows_left_out":26}
{"sheet":"5. Engagement ","index":17,"n_rows":21,"n_cols":7,"rows_kept":21,"cut":false,"hidden":true,"merged":[[16,0,16,6],[1,0,1,6],[4,0,4,6],[5,0,5,6],[12,0,14,1],[15,0,15,6]]}
[]
["5. Engagement"]
[]
[]
["Users"]
["The NHS has a duty to promote the participation of the patient and public in decisions about their health and care.  These duties are brought together in the NHS Constitution and apply to children and young people as well as adults.\nTo fulfil these statutory obligations there are a number of elements which should be in place:\n• A policy on engaging with hard to reach groups and an active strategy for its implementation which includes events and activities.\n• Able to demonstrate how it responds to the feedback which results from engagement activities, particularly in relation to commissioning.\n• A mechanism for engagement with children and young people and their families – this may be through its local parent carer forum.\n\nChildren, young people and families should experience well coordinated assessment and planning leading to timely, well-informed decisions. Local authorities must consult the child and the child’s parent or the young person throughout the process of assessment and production of an EHC plan, and families should be closely involved in the process, by: \n\n• being provided with access to the relevant information in accessible formats; \n• given time to prepare for discussions and meetings, and \n• being allowed dedicated time in discussions and meetings to air their views. \n\nThe lay representation in the CCG’s Governing Body would provide a means for lay scrutiny of joint arrangements, but there does need to be a clear line of sight from the CCG executive. Senior understanding of the statutory duties could be assured through a regular, although not too frequent standing item on the agenda of executive meetings (or an appropriate sub-group). \n\nNote that local Parent Carer forums and other patient / user representation groups are likely to be determined in their wish to hold CCGs to account for their role in relation to children's disability, an area which can attract significant local press attention.  "]
{"$rows_left_out":16}
{"sheet":"6. Monitoring & Redress","index":18,"n_rows":55,"n_cols":7,"rows_kept":55,"cut":false,"hidden":true,"merged":[[47,0,49,1],[47,5,49,5],[47,6,49,6],[24,0,24,6],[25,0,25,6],[28,0,28,6],[29,0,29,6],[31,1,32,1],[33,1,34,1],[37,0,39,1],[37,5,39,5],[37,6,39,6],[41,0,41,6],[42,0,42,6],[14,0,14,6],[15,0,15,6],[17,1,20,1],[21,0,23,1],[21,5,23,5],[21,6,23,6],[1,0,1,6],[4,0,4,6],[5,0,5,6],[10,0,12,1],[10,5,12,5],[10,6,12,6]]}
[]
["6. Monitoring & Redress"]
[]
[]
["Data to Monitor Progress"]
["Effective implementation can only be ensured through appropriate monitoring of the joint commissioning arrangements between CCG and local authority, of the process for developing individual EHC plans, and the success of the plans in delivering the outcomes specified for the child or young person. Given the comparative paucity of data collected on children’s disability, the CCG will need to identify and collect its own dataset of indicators of effective implementation, covering both process measures, and health and wellbeing outcomes for the child or young person. Engagement with children, young people and their families will also allow evidence of the user-reported experience to inform a view of implementation. Deep dive scrutiny of individual plans might identify gaps between need and provision (e.g. for SLT).  The Children and Young People's Dataset has been mandated for central flow from all NHS providers to HSCIC since September 2015.  This will, when fully implemented provide a rich source of data for CCGs and they will wish to ensure that providers are implementing the dataset.\n\nSee the annex for suggestions for monitoring information. "]
{"$rows_left_out":50}
{"sheet":"Code Lists","index":19,"n_rows":213,"n_cols":4,"rows_kept":213,"cut":false,"hidden":true,"merged":[]}
["Choose CCG",null,"Coding:","Mark"]
[]
["NHS City and Hackney CCG",null,"Please Select",0]
["NHS Barking and Dagenham CCG",null,"No Compliance: Not started. ",1]
["NHS Barnet CCG",null,"Partially Achieved: Some Progress/Implemented in some areas",2]
["NHS Bexley CCG",null,"Full Compliance: Fully Achieved/Implemented",3]
{"$rows_left_out":207}