{"text_format":"1","workbook":"xlsx","n_sheets":11,"sheets":["Information","Data","Calc","LA - mapping","Summary LA","1. LA - Leadership","2. LA - Joint Arrangements","3. LA - Commissioning","4. LA - EHC Plan","5. LA - Co-Production","6. LA - Monitor & Redress"],"not_rendered":{"charts":28,"images":3,"macros":1,"external_links":0,"defined_names":4,"comments":0,"pivot_tables":0},"unopened":[],"bounds":{"document_bytes":16777216,"sheet_cells":100000,"rows_first":2000,"rows_last":500,"rows_between":2000,"halvings":0,"cell_chars":16384,"cell_head_chars":4096},"cells_cut":0,"cells_raw":0,"read":"whole","date_system":"1900"}

{"sheet":"Information","index":0,"n_rows":30,"n_cols":4,"rows_kept":30,"cut":false,"hidden":false,"merged":[]}
[]
[null,null,null,"Special Educational Needs & Disability (SEND)\nDiagnostic Checklist For Local Authorities"]
[]
[]
[null,null,null,"INTRODUCTION"]
[]
[]
[null,null,null,"Local Authority (LA) Diagnostic checklist"]
[]
[null,null,null,"The Children and Families Act 2014"]
{"$rows_left_out":21}
{"sheet":"Data","index":1,"n_rows":114,"n_cols":10,"rows_kept":114,"cut":false,"hidden":true,"merged":[]}
["Type","Section","Section_ID","Sub-Section","SS_ID","Q","Audit1","Audit2","Audit1_Score","Audit2_Score"]
["LA","1. Leadership",1,"Governance and Leadership",1.1000000000000001,1,{"$f":"'1. LA - Leadership'!G10","v":"Please Select"},{"$f":"'1. LA - Leadership'!H10","v":"Please Select"},{"$f":"VLOOKUP(G2,'LA - mapping'!$B$6:$C$9,2,0)","v":0},{"$f":"VLOOKUP(H2,'LA - mapping'!$B$6:$C$9,2,0)","v":0}]
["LA","1. Leadership",1,"Governance and Leadership",1.1000000000000001,2,{"$f":"'1. LA - Leadership'!G11","v":"Please Select"},{"$f":"'1. LA - Leadership'!H11","v":"Please Select"},{"$f":"VLOOKUP(G3,'LA - mapping'!$B$6:$C$9,2,0)","v":0},{"$f":"VLOOKUP(H3,'LA - mapping'!$B$6:$C$9,2,0)","v":0}]
["LA","1. Leadership",1,"Governance and Leadership",1.1000000000000001,3,{"$f":"'1. LA - Leadership'!G12","v":"Please Select"},{"$f":"'1. LA - Leadership'!H12","v":"Please Select"},{"$f":"VLOOKUP(G4,'LA - mapping'!$B$6:$C$9,2,0)","v":0},{"$f":"VLOOKUP(H4,'LA - mapping'!$B$6:$C$9,2,0)","v":0}]
["LA","1. Leadership",1,"Governance and Leadership",1.1000000000000001,4,{"$f":"'1. LA - Leadership'!G13","v":"Please Select"},{"$f":"'1. LA - Leadership'!H13","v":"Please Select"},{"$f":"VLOOKUP(G5,'LA - mapping'!$B$6:$C$9,2,0)","v":0},{"$f":"VLOOKUP(H5,'LA - mapping'!$B$6:$C$9,2,0)","v":0}]
["LA","1. Leadership",1,"Governance and Leadership",1.1000000000000001,5,{"$f":"'1. LA - Leadership'!G14","v":"Please Select"},{"$f":"'1. LA - Leadership'!H14","v":"Please Select"},{"$f":"VLOOKUP(G6,'LA - mapping'!$B$6:$C$9,2,0)","v":0},{"$f":"VLOOKUP(H6,'LA - mapping'!$B$6:$C$9,2,0)","v":0}]
["LA","1. Leadership",1,"Governance and Leadership",1.1000000000000001,6,{"$f":"'1. LA - Leadership'!G15","v":"Please Select"},{"$f":"'1. LA - Leadership'!H15","v":"Please Select"},{"$f":"VLOOKUP(G7,'LA - mapping'!$B$6:$C$9,2,0)","v":0},{"$f":"VLOOKUP(H7,'LA - mapping'!$B$6:$C$9,2,0)","v":0}]
["LA","1. Leadership",1,"Governance and Leadership",1.1000000000000001,7,{"$f":"'1. LA - Leadership'!G16","v":"Please Select"},{"$f":"'1. LA - Leadership'!H16","v":"Please Select"},{"$f":"VLOOKUP(G8,'LA - mapping'!$B$6:$C$9,2,0)","v":0},{"$f":"VLOOKUP(H8,'LA - mapping'!$B$6:$C$9,2,0)","v":0}]
["LA","1. Leadership",1,"Governance and Leadership",1.1000000000000001,8,{"$f":"'1. LA - Leadership'!G17","v":"Please Select"},{"$f":"'1. LA - Leadership'!H17","v":"Please Select"},{"$f":"VLOOKUP(G9,'LA - mapping'!$B$6:$C$9,2,0)","v":0},{"$f":"VLOOKUP(H9,'LA - mapping'!$B$6:$C$9,2,0)","v":0}]
["LA","1. Leadership",1,"Governance and Leadership",1.1000000000000001,9,{"$f":"'1. LA - Leadership'!G18","v":"Please Select"},{"$f":"'1. LA - Leadership'!H18","v":"Please Select"},{"$f":"VLOOKUP(G10,'LA - mapping'!$B$6:$C$9,2,0)","v":0},{"$f":"VLOOKUP(H10,'LA - mapping'!$B$6:$C$9,2,0)","v":0}]
{"$rows_left_out":105}
{"sheet":"Calc","index":2,"n_rows":35,"n_cols":23,"rows_kept":35,"cut":false,"hidden":true,"merged":[]}
[]
[]
[null,null,null,null,"1st AUDIT: SCORE",null,null,null,"1st AUDIT: PERCENTAGE",null,null,null,null,null,"2nd AUDIT: SCORE",null,null,null,"2nd AUDIT: PERCENTAGE"]
[null,null,null,null,3,2,1,0,null,null,null,null,null,null,3,2,1,0]
[null,"Section_ID","Sub-Section","No of Qs","Green","Amber","Red","No Response","No Compliance","Partial Compliance","Full Compliance","No Response","Validation",null,"Green","Amber","Red","No Response","No Compliance","Partial Compliance","Full Compliance","No Response","Validation"]
[null,1,"Governance and Leadership",{"$f":"COUNTIFS(Data!$A:$A,\"LA\",Data!$C:$C,Calc!$B6,Data!$D:$D,Calc!$C6)","v":9},{"$f":"COUNTIFS(Data!$A:$A,\"LA\",Data!$C:$C,Calc!$B6,Data!$D:$D,Calc!$C6,Data!$I:$I,Calc!E$4)","v":0},{"$f":"COUNTIFS(Data!$A:$A,\"LA\",Data!$C:$C,Calc!$B6,Data!$D:$D,Calc!$C6,Data!$I:$I,Calc!F$4)","v":0},{"$f":"COUNTIFS(Data!$A:$A,\"LA\",Data!$C:$C,Calc!$B6,Data!$D:$D,Calc!$C6,Data!$I:$I,Calc!G$4)","v":0},{"$f":"COUNTIFS(Data!$A:$A,\"LA\",Data!$C:$C,Calc!$B6,Data!$D:$D,Calc!$C6,Data!$I:$I,Calc!H$4)","v":9},{"$f":"G6/$D6","v":0},{"$f":"F6/$D6","v":0},{"$f":"E6/$D6","v":0},{"$f":"H6/$D6","v":1},{"$f":"SUM(I6:L6)","v":1},null,{"$f":"COUNTIFS(Data!$A:$A,\"LA\",Data!$C:$C,Calc!$B6,Data!$D:$D,Calc!$C6,Data!$J:$J,Calc!O$4)","v":0},{"$f":"COUNTIFS(Data!$A:$A,\"LA\",Data!$C:$C,Calc!$B6,Data!$D:$D,Calc!$C6,Data!$J:$J,Calc!P$4)","v":0},{"$f":"COUNTIFS(Data!$A:$A,\"LA\",Data!$C:$C,Calc!$B6,Data!$D:$D,Calc!$C6,Data!$J:$J,Calc!Q$4)","v":0},{"$f":"COUNTIFS(Data!$A:$A,\"LA\",Data!$C:$C,Calc!$B6,Data!$D:$D,Calc!$C6,Data!$J:$J,Calc!R$4)","v":9},{"$f":"Q6/$D6","v":0},{"$f":"P6/$D6","v":0},{"$f":"O6/$D6","v":0},{"$f":"R6/$D6","v":1},{"$f":"SUM(S6:V6)","v":1}]
[null,1,"Requests for high cost residential or specialist placements for children and young people with complex needs",{"$f":"COUNTIFS(Data!$A:$A,\"LA\",Data!$C:$C,Calc!$B7,Data!$D:$D,Calc!$C7)","v":3},{"$f":"COUNTIFS(Data!$A:$A,\"LA\",Data!$C:$C,Calc!$B7,Data!$D:$D,Calc!$C7,Data!$I:$I,Calc!E$4)","v":0},{"$f":"COUNTIFS(Data!$A:$A,\"LA\",Data!$C:$C,Calc!$B7,Data!$D:$D,Calc!$C7,Data!$I:$I,Calc!F$4)","v":0},{"$f":"COUNTIFS(Data!$A:$A,\"LA\",Data!$C:$C,Calc!$B7,Data!$D:$D,Calc!$C7,Data!$I:$I,Calc!G$4)","v":0},{"$f":"COUNTIFS(Data!$A:$A,\"LA\",Data!$C:$C,Calc!$B7,Data!$D:$D,Calc!$C7,Data!$I:$I,Calc!H$4)","v":3},{"$f":"G7/$D7","v":0},{"$f":"F7/$D7","v":0},{"$f":"E7/$D7","v":0},1,1,null,{"$f":"COUNTIFS(Data!$A:$A,\"LA\",Data!$C:$C,Calc!$B7,Data!$D:$D,Calc!$C7,Data!$J:$J,Calc!O$4)","v":0},{"$f":"COUNTIFS(Data!$A:$A,\"LA\",Data!$C:$C,Calc!$B7,Data!$D:$D,Calc!$C7,Data!$J:$J,Calc!P$4)","v":0},{"$f":"COUNTIFS(Data!$A:$A,\"LA\",Data!$C:$C,Calc!$B7,Data!$D:$D,Calc!$C7,Data!$J:$J,Calc!Q$4)","v":0},{"$f":"COUNTIFS(Data!$A:$A,\"LA\",Data!$C:$C,Calc!$B7,Data!$D:$D,Calc!$C7,Data!$J:$J,Calc!R$4)","v":3},{"$f":"Q7/$D7","v":0},{"$f":"P7/$D7","v":0},{"$f":"O7/$D7","v":0},1,1]
[null,1,"Monitoring and Agreeing Plans",{"$f":"COUNTIFS(Data!$A:$A,\"LA\",Data!$C:$C,Calc!$B8,Data!$D:$D,Calc!$C8)","v":2},{"$f":"COUNTIFS(Data!$A:$A,\"LA\",Data!$C:$C,Calc!$B8,Data!$D:$D,Calc!$C8,Data!$I:$I,Calc!E$4)","v":0},{"$f":"COUNTIFS(Data!$A:$A,\"LA\",Data!$C:$C,Calc!$B8,Data!$D:$D,Calc!$C8,Data!$I:$I,Calc!F$4)","v":0},{"$f":"COUNTIFS(Data!$A:$A,\"LA\",Data!$C:$C,Calc!$B8,Data!$D:$D,Calc!$C8,Data!$I:$I,Calc!G$4)","v":0},{"$f":"COUNTIFS(Data!$A:$A,\"LA\",Data!$C:$C,Calc!$B8,Data!$D:$D,Calc!$C8,Data!$I:$I,Calc!H$4)","v":2},0,0,0,1,1,null,{"$f":"COUNTIFS(Data!$A:$A,\"LA\",Data!$C:$C,Calc!$B8,Data!$D:$D,Calc!$C8,Data!$J:$J,Calc!O$4)","v":0},{"$f":"COUNTIFS(Data!$A:$A,\"LA\",Data!$C:$C,Calc!$B8,Data!$D:$D,Calc!$C8,Data!$J:$J,Calc!P$4)","v":0},{"$f":"COUNTIFS(Data!$A:$A,\"LA\",Data!$C:$C,Calc!$B8,Data!$D:$D,Calc!$C8,Data!$J:$J,Calc!Q$4)","v":0},{"$f":"COUNTIFS(Data!$A:$A,\"LA\",Data!$C:$C,Calc!$B8,Data!$D:$D,Calc!$C8,Data!$J:$J,Calc!R$4)","v":2},0,0,0,1,1]
[null,1,"Resourcing Joint Arrangements",{"$f":"COUNTIFS(Data!$A:$A,\"LA\",Data!$C:$C,Calc!$B9,Data!$D:$D,Calc!$C9)","v":4},{"$f":"COUNTIFS(Data!$A:$A,\"LA\",Data!$C:$C,Calc!$B9,Data!$D:$D,Calc!$C9,Data!$I:$I,Calc!E$4)","v":0},{"$f":"COUNTIFS(Data!$A:$A,\"LA\",Data!$C:$C,Calc!$B9,Data!$D:$D,Calc!$C9,Data!$I:$I,Calc!F$4)","v":0},{"$f":"COUNTIFS(Data!$A:$A,\"LA\",Data!$C:$C,Calc!$B9,Data!$D:$D,Calc!$C9,Data!$I:$I,Calc!G$4)","v":0},{"$f":"COUNTIFS(Data!$A:$A,\"LA\",Data!$C:$C,Calc!$B9,Data!$D:$D,Calc!$C9,Data!$I:$I,Calc!H$4)","v":4},0,0,0,1,1,null,{"$f":"COUNTIFS(Data!$A:$A,\"LA\",Data!$C:$C,Calc!$B9,Data!$D:$D,Calc!$C9,Data!$J:$J,Calc!O$4)","v":0},{"$f":"COUNTIFS(Data!$A:$A,\"LA\",Data!$C:$C,Calc!$B9,Data!$D:$D,Calc!$C9,Data!$J:$J,Calc!P$4)","v":0},{"$f":"COUNTIFS(Data!$A:$A,\"LA\",Data!$C:$C,Calc!$B9,Data!$D:$D,Calc!$C9,Data!$J:$J,Calc!Q$4)","v":0},{"$f":"COUNTIFS(Data!$A:$A,\"LA\",Data!$C:$C,Calc!$B9,Data!$D:$D,Calc!$C9,Data!$J:$J,Calc!R$4)","v":4},0,0,0,1,1]
[null,2,"Joint Arrangements",{"$f":"COUNTIFS(Data!$A:$A,\"LA\",Data!$C:$C,Calc!$B10,Data!$D:$D,Calc!$C10)","v":9},{"$f":"COUNTIFS(Data!$A:$A,\"LA\",Data!$C:$C,Calc!$B10,Data!$D:$D,Calc!$C10,Data!$I:$I,Calc!E$4)","v":0},{"$f":"COUNTIFS(Data!$A:$A,\"LA\",Data!$C:$C,Calc!$B10,Data!$D:$D,Calc!$C10,Data!$I:$I,Calc!F$4)","v":0},{"$f":"COUNTIFS(Data!$A:$A,\"LA\",Data!$C:$C,Calc!$B10,Data!$D:$D,Calc!$C10,Data!$I:$I,Calc!G$4)","v":0},{"$f":"COUNTIFS(Data!$A:$A,\"LA\",Data!$C:$C,Calc!$B10,Data!$D:$D,Calc!$C10,Data!$I:$I,Calc!H$4)","v":9},0,0,0,1,1,null,{"$f":"COUNTIFS(Data!$A:$A,\"LA\",Data!$C:$C,Calc!$B10,Data!$D:$D,Calc!$C10,Data!$J:$J,Calc!O$4)","v":0},{"$f":"COUNTIFS(Data!$A:$A,\"LA\",Data!$C:$C,Calc!$B10,Data!$D:$D,Calc!$C10,Data!$J:$J,Calc!P$4)","v":0},{"$f":"COUNTIFS(Data!$A:$A,\"LA\",Data!$C:$C,Calc!$B10,Data!$D:$D,Calc!$C10,Data!$J:$J,Calc!Q$4)","v":0},{"$f":"COUNTIFS(Data!$A:$A,\"LA\",Data!$C:$C,Calc!$B10,Data!$D:$D,Calc!$C10,Data!$J:$J,Calc!R$4)","v":9},0,0,0,1,1]
{"$rows_left_out":26}
{"sheet":"LA - mapping","index":3,"n_rows":155,"n_cols":9,"rows_kept":155,"cut":false,"hidden":true,"merged":[]}
[]
[]
[]
[]
[null,"Audit 1 and 2 response","Mark",null,"Trend",null,"Combined","Region","Council"]
[null,"Please Select",0,null,"Please Select",null,"East - Bedford","East","Bedford"]
[null,"No Compliance: Not started. ",1,null,"Complete at 2nd Audit",null,"East - Cambridgeshire","East","Cambridgeshire"]
[null,"Partially Achieved: Some Progress/Implemented in some areas",2,null,"Improvement",null,"East - Central Bedfordshire","East","Central Bedfordshire"]
[null,"Full Compliance: Fully Achieved/Implemented",3,null,"No Change",null,"East - Essex","East","Essex"]
[null,null,null,null,"Decrease",null,"East - Hertfordshire","East","Hertfordshire"]
{"$rows_left_out":146}
{"sheet":"Summary LA","index":4,"n_rows":286,"n_cols":14,"rows_kept":286,"cut":false,"hidden":false,"merged":[[1,3,1,17],[4,8,4,10],[5,8,5,10]]}
[]
[null,null,null,"Special Educational Needs & Disability (SEND) Diagnostic Checklist for Local Authorities"]
[]
[]
[null,null,null,null,null,null,null,"REGION"]
[null,null,null,null,null,null,null,"LOCAL AUTHORITY"]
[]
[]
[]
[]
{"$rows_left_out":277}
{"sheet":"1. LA - Leadership","index":5,"n_rows":83,"n_cols":10,"rows_kept":83,"cut":false,"hidden":false,"merged":[[72,3,72,9],[6,3,6,9],[35,3,35,9],[52,3,52,9]]}
[]
[null,null,null,"1. LEADERSHIP"]
[]
[null,null,null,"Governance and Leadership"]
[]
[null,null,null,"Additional Notes (press '+' sign to expand)"]
[null,null,null,"\nTop tier local authorities must designate one of its members as Lead Member for Children’s Services (LMCS) and appoint a Director for Children’s Services (DCS). The DCS has professional responsibility for children’s services, including operational matters; the LMCS has political responsibility for children’s services.  The DCS and LMCS have a key leadership role both within the local authority and working with other local agencies to improve outcomes for disabled children and young people and those with SEN.\n\nThe DCS and LMCS should report to the Chief Executive and to the Council Leader or Mayor respectively as they are the post holders with ultimate responsibility for the political and corporate leadership of the Council. They are also accountable for ensuring that the effectiveness of steps taken and capacity to improve outcomes for all children and young people is reflected across the full range of the Council’s business. \nThere is statutory guidance on the roles and responsibilities of the Director of Children’s Services and the Lead Member for Children’s Services."]
[]
[null,null,null,"Prompts for Implementation","Key Indicators / Evidence","LA Named Lead","1st Audit RAG Rating: DD/MM/YY","2nd Audit RAG Rating: DD/MM/YY","Trend","Comments/Evidence"]
[null,null,null,"Is there democratic scrutiny of the local authority's arrangements for disabled children and young people and those with SEN?","The LMCS and DCS report regularly to elected members on SEND.\n\nSEND has been recently considered by an overview and scrutiny committee, or there are plans to do so. \n\nThe Nominated Officer for SEN produces regular updates on implementing SEND reforms for LMCS. \n\nReports are made to LA Corporate Parenting Board and Children's Safeguarding Board on delivery of SEND strategy.",null,"Please Select","Please Select","Please Select"]
{"$rows_left_out":74}
{"sheet":"2. LA - Joint Arrangements","index":6,"n_rows":119,"n_cols":10,"rows_kept":119,"cut":false,"hidden":false,"merged":[[65,3,65,9],[68,4,70,4],[85,3,85,9],[6,3,6,9],[38,3,38,9],[41,4,42,4]]}
[]
[null,null,null,"2. Joint Arrangements"]
[]
[null,null,null,"Working across the local authority and with health services"]
[]
[null,null,null,"Additional Notes (press '+' sign to expand)"]
[null,null,null,"\nSection 25 of the Children and Families Act 2014 places a duty on local authorities that should ensure integration between educational provision and training provision, health and social care provision, where this would promote wellbeing and improve the quality of provision for disabled young people and those with SEN. Local authorities and clinical commissioning groups (CCGs) must make joint commissioning arrangements for education, health and care provision for children and young people with SEN or disabilities (Section 26 of the Act). The term ‘partners’ refers to the local authority and its partner commissioning bodies across education, health and social care provision for children and young people with SEN or disabilities, including clinicians’ commissioning arrangements, and NHS England for specialist health provision.\n\nLocal authorities, NHS England and their partner CCGs must make arrangements for agreeing the education, health and social care provision reasonably required by local children and young people with SEN or disabilities. Joint commissioning must also include arrangements for:\n• securing EHC needs assessments\n• securing the education, health and care provision specified in EHC plans, and\n• agreeing Personal Budgets"]
[]
[null,null,null,"Prompts for Implementation","Key Indicators / Evidence","LA Named Lead","1st Audit RAG Rating: DD/MM/YY","2nd Audit RAG Rating: DD/MM/YY","Trend","Comments/Evidence"]
[null,null,null,"Are the joint commissioning arrangements with the CCG fully documented, and subject to a written agreement?","The arrangements are documented and easily accessible.",null,"Please Select","Please Select","Please Select"]
{"$rows_left_out":110}
{"sheet":"3. LA - Commissioning","index":7,"n_rows":128,"n_cols":10,"rows_kept":128,"cut":false,"hidden":false,"merged":[[58,3,58,9],[84,3,84,9],[113,3,113,9],[6,3,6,9],[32,3,32,9]]}
[]
[null,null,null,"3. Commissioning"]
[]
[null,null,null,"Assessing Local Need"]
[]
[null,null,null,"Additional Notes (press '+' sign to expand)"]
[null,null,null,"\nLocal authorities must carry out their functions with a view to identifying all the children and young people in their area who have or may have SEN or have or may have a disability (Section 22 of the Children and Families Act 2014). Local authorities may gather information on children and young people with SEN or disabilities in a number of ways. Anyone can bring a child or young person who they believe has or probably has SEN or a disability to the attention of a local authority (Section 24 of the Children and Families Act 2014) and parents, early years providers, schools and colleges should be encouraged to do so.\n\nLocal authorities must keep data on disabled children on the register of disabled children they are required to keep under Schedule 2 of the Children Act 1989. Local authorities should ensure that registers of disabled children and young people are kept accurate and up to date, and pay particular attention to including low-incidence needs that are particularly difficult to plan for from national data sets."]
[]
[null,null,null,"Prompts for Implementation","Key Indicators / Evidence","LA Named Lead","1st Audit RAG Rating: DD/MM/YY","2nd Audit RAG Rating: DD/MM/YY","Trend","Comments/Evidence"]
[null,null,null,"Does the local authority actively seek to identify all disabled children and young people, and those with SEN, in their area?","The local authority proactively collects information from early years providers, schools, colleges and other education providers on the number of children who receive SEN support.\n\nThe local authority proactively encourages CCGs, NHS Trusts and NHS Foundation Trusts to inform them if they identify a child under compulsory school age as having, or probably having, SEN or a disability\n\nThe local authority draws on information from early health screening programmes\n\nUsing annual school census data to inform strategic planning and joint commissioning\n\nEYFS profile data is analysed to ensure children with SEN are identified at an early stage",null,"Please Select","Please Select","Please Select"]
{"$rows_left_out":119}
{"sheet":"4. LA - EHC Plan","index":8,"n_rows":86,"n_cols":10,"rows_kept":86,"cut":false,"hidden":false,"merged":[[6,3,6,9],[59,3,59,9],[29,3,29,9]]}
[]
[null,null,null,"4. Education, Health & Care Plan"]
[]
[null,null,null,"SEN Support and Early Help (Coordinated assessment) "]
[]
[null,null,null,"Additional Notes (press '+' sign to expand)"]
[null,null,null,"\nLocal authorities are responsible for all the children and young people in their area who have or may have SEN (section 24 of the Children and Families Act). This includes children and young people who are receiving SEN support.\n\nLocal authorities have a key role to play in supporting the capacity of education settings to identify and meet the needs of children and young people with SEN, including by providing specialist support to advise them on early identification and effective support and interventions for children receiving SEN support. Settings and the local authority should work closely together to ensure there are clear arrangements accessing specialist support. \n\nLocal authorities also have a key role in helping education settings to develop their offer of support, and have a duty to set out the provision that they expect settings to have available in the Local Offer. This includes agreeing what settings are expected to provide out of their delegated budgets, and when the local authority would expect to provide top-up funding out of the high needs block."]
[]
[null,null,null,"Prompts for Implementation","Key Indicators / Evidence","LA Named Lead","1st Audit RAG Rating: DD/MM/YY","2nd Audit RAG Rating: DD/MM/YY","Trend","Comments/Evidence"]
[null,null,null,"How is the LA working with early years settings/schools/FE settings to develop and promote their offer for CYP with SEN support needs?","The local offer and school SEN offer should clearly articulate the support available to this group of CYP and how it can be accessed. \n\nHow are the needs of a CYP with SEN needs identified and recorded? Is there a person centred plan as part of a graduated pathway?",null,"Please Select","Please Select","Please Select"]
{"$rows_left_out":77}
{"sheet":"5. LA - Co-Production","index":9,"n_rows":52,"n_cols":10,"rows_kept":52,"cut":false,"hidden":false,"merged":[[6,3,6,9]]}
[]
[null,null,null,"5. Co-production (Engagement)"]
[]
[null,null,null,"Children, Young People and Parents"]
[]
[null,null,null,"Additional Notes (press '+' sign to expand)"]
[null,null,null,"\nSection 19 requires local authorities to have regard to a set of core principles when carrying out their functions under Part 3 of the Children and Families Act 2014. When they are undertaking any function under Part 3 of the Children and Families Act, local authorities must have regard to:\n\n• the views, wishes and feelings of children and their parents, or the young person;\n• the importance of the child and their parents, or the young person, participating as fully as possible in decisions;\n• the importance of the child and their parents, or the young person, being provided with the information and support they need in order to participate in decision-making; \n• the need to support parents, children and young people so that children and young people achieve the best possible educational and other outcomes\n\nThese considerations must be applied at both the strategic commissioning and the individual level. In addition to Section 19, the local authority must involve and consult children, parents and young people specifically when reviewing the education, social care and training provision on offer in the local area (Section 27) and developing and reviewing the Local Offer (Section 30)."]
[]
[null,null,null,"Prompts for Implementation","Key Indicators / Evidence","LA Named Lead","1st Audit RAG Rating: DD/MM/YY","2nd Audit RAG Rating: DD/MM/YY","Trend","Comments/Evidence"]
[null,null,null,"Is the Parent Carer Forum (or equivalent group) and wider group of parents involved at all stages in the planning, delivery and monitoring of services?","Evidence can be provided as to how the local authority responds to feedback from engagement in its policies, particularly in relation to commissioning.\n\nThe input of parent groups is recognised, valued, planned and resourced (for example, through appropriate remuneration and training)\n\nThere are strong feedback mechanisms to ensure that parents understand the impact their participation is making",null,"Please Select","Please Select","Please Select"]
{"$rows_left_out":43}
{"sheet":"6. LA - Monitor & Redress","index":10,"n_rows":93,"n_cols":10,"rows_kept":93,"cut":false,"hidden":false,"merged":[[62,3,62,9],[79,3,79,9],[6,3,6,9],[22,3,22,9]]}
[]
[null,null,null,"6. Monitoring & Redress"]
[]
[null,null,null,"Data to Monitor Progress"]
[]
[null,null,null,"Additional Notes (press '+' sign to expand)"]
[null,null,null,"\nEffective implementation can only be ensured through appropriate monitoring of the joint commissioning arrangements between CCG and local authority, of the process for developing individual EHC plans, and the success of the plans in delivering the outcomes specified for the child or young person. Local authorities and CCGs will need to identify and collect its own dataset of indicators of effective implementation and improved outcomes, covering both process measures, and health and wellbeing outcomes for the child or young person. Engagement with children, young people and their families will allow evidence of the user-reported experience to inform a view of implementation."]
[]
[null,null,null,"Prompts for Implementation","Key Indicators / Evidence","LA Named Lead","1st Audit RAG Rating: DD/MM/YY","2nd Audit RAG Rating: DD/MM/YY","Trend","Comments/Evidence"]
[null,null,null,"Does the local authority use robust data and evidence to monitor progress towards successful implementation of SEND arrangements? \n\n\n","The local authority produces regular performance reports using a range of agreed outcome indicators , and reflects on their implications. \n\nThe range of evidence considered includes: \n- quality of engagement with children, parents and young \n- progress on individual EHC plans; \n- improvements in health and wellbeing outcomes for children and young people with SEND",null,"Please Select","Please Select","Please Select"]
{"$rows_left_out":83}