{"text_format":"1","workbook":"xlsx","n_sheets":10,"sheets":["Information","Data","Calc","LA - mapping","Summary SC","1. Leadership","2. Joint Arrangements","3. Commissioning","4. EHC Plan","5. Co-Production"],"not_rendered":{"charts":24,"images":3,"macros":1,"external_links":0,"defined_names":6,"comments":0,"pivot_tables":0},"unopened":[],"bounds":{"document_bytes":16777216,"sheet_cells":100000,"rows_first":2000,"rows_last":500,"rows_between":2000,"halvings":0,"cell_chars":16384,"cell_head_chars":4096},"cells_cut":0,"cells_raw":0,"read":"whole","date_system":"1900"}

{"sheet":"Information","index":0,"n_rows":26,"n_cols":4,"rows_kept":26,"cut":false,"hidden":false,"merged":[]}
[]
[]
[]
[]
[null,null,null,"INTRODUCTION"]
[]
[]
[null,null,null,"The Children and Families Act 2014"]
[]
[null,null,null,"The Children and Families Act is a statutory framework for the integration and personalisation of services for children and young people with special educational needs and or disabilities (SEND). Improving outcomes, experiences and services for children, young people and their families requires education, social care and health services in England to work closely together at both a strategic joint commissioning level and through the provision of integrated services for individuals through Education, Health and Care Plans."]
{"$rows_left_out":17}
{"sheet":"Data","index":1,"n_rows":49,"n_cols":10,"rows_kept":49,"cut":false,"hidden":true,"merged":[]}
["m1","Section","Section_ID","Sub-Section","SS_ID","Q","Audit1","Audit2","Audit1_Score","Audit2_Score"]
[null,"1. Leadership",1,"Governance and Leadership",1.1000000000000001,1,{"$f":"'1. Leadership'!G7","v":"Please Select"},{"$f":"'1. Leadership'!H7","v":"Please Select"},{"$f":"VLOOKUP(G2,'LA - mapping'!$B$6:$C$9,2,0)","v":0},{"$f":"VLOOKUP(H2,'LA - mapping'!$B$6:$C$9,2,0)","v":0}]
[null,"1. Leadership",1,"Governance and Leadership",1.1000000000000001,2,{"$f":"'1. Leadership'!G8","v":"Please Select"},{"$f":"'1. Leadership'!H8","v":"Please Select"},{"$f":"VLOOKUP(G3,'LA - mapping'!$B$6:$C$9,2,0)","v":0},{"$f":"VLOOKUP(H3,'LA - mapping'!$B$6:$C$9,2,0)","v":0}]
[null,"1. Leadership",1,"Governance and Leadership",1.1000000000000001,3,{"$f":"'1. Leadership'!G9","v":"Please Select"},{"$f":"'1. Leadership'!H9","v":"Please Select"},{"$f":"VLOOKUP(G4,'LA - mapping'!$B$6:$C$9,2,0)","v":0},{"$f":"VLOOKUP(H4,'LA - mapping'!$B$6:$C$9,2,0)","v":0}]
[null,"1. Leadership",1,"Governance and Leadership",1.1000000000000001,4,{"$f":"'1. Leadership'!G10","v":"Please Select"},{"$f":"'1. Leadership'!H10","v":"Please Select"},{"$f":"VLOOKUP(G5,'LA - mapping'!$B$6:$C$9,2,0)","v":0},{"$f":"VLOOKUP(H5,'LA - mapping'!$B$6:$C$9,2,0)","v":0}]
[null,"1. Leadership",1,"Monitoring and Agreeing Plans",1.2,1,{"$f":"'1. Leadership'!G17","v":"Please Select"},{"$f":"'1. Leadership'!H17","v":"Please Select"},{"$f":"VLOOKUP(G6,'LA - mapping'!$B$6:$C$9,2,0)","v":0},{"$f":"VLOOKUP(H6,'LA - mapping'!$B$6:$C$9,2,0)","v":0}]
[null,"1. Leadership",1,"Monitoring and Agreeing Plans",1.2,2,{"$f":"'1. Leadership'!G18","v":"Please Select"},{"$f":"'1. Leadership'!H18","v":"Please Select"},{"$f":"VLOOKUP(G7,'LA - mapping'!$B$6:$C$9,2,0)","v":0},{"$f":"VLOOKUP(H7,'LA - mapping'!$B$6:$C$9,2,0)","v":0}]
[null,"1. Leadership",1,"Resourcing Joint Arrangements",1.3,1,{"$f":"'1. Leadership'!G25","v":"Please Select"},{"$f":"'1. Leadership'!H25","v":"Please Select"},{"$f":"VLOOKUP(G8,'LA - mapping'!$B$6:$C$9,2,0)","v":0},{"$f":"VLOOKUP(H8,'LA - mapping'!$B$6:$C$9,2,0)","v":0}]
[null,"1. Leadership",1,"Resourcing Joint Arrangements",1.3,2,{"$f":"'1. Leadership'!G26","v":"Please Select"},{"$f":"'1. Leadership'!H26","v":"Please Select"},{"$f":"VLOOKUP(G9,'LA - mapping'!$B$6:$C$9,2,0)","v":0},{"$f":"VLOOKUP(H9,'LA - mapping'!$B$6:$C$9,2,0)","v":0}]
[null,"1. Leadership",1,"Thresholds and Eligibility Criteria",1.4,1,{"$f":"'1. Leadership'!G33","v":"Please Select"},{"$f":"'1. Leadership'!H33","v":"Please Select"},{"$f":"VLOOKUP(G10,'LA - mapping'!$B$6:$C$9,2,0)","v":0},{"$f":"VLOOKUP(H10,'LA - mapping'!$B$6:$C$9,2,0)","v":0}]
{"$rows_left_out":40}
{"sheet":"Calc","index":2,"n_rows":29,"n_cols":23,"rows_kept":29,"cut":false,"hidden":true,"merged":[]}
[]
[]
[null,null,null,null,"1st AUDIT: SCORE",null,null,null,"1st AUDIT: PERCENTAGE",null,null,null,null,null,"2nd AUDIT: SCORE",null,null,null,"2nd AUDIT: PERCENTAGE"]
[null,null,null,null,3,2,1,0,null,null,null,null,null,null,3,2,1,0]
[null,"Section_ID","Sub-Section","No of Qs","Green","Amber","Red","No Response","No Compliance","Partial Compliance","Full Compliance","No Response","Validation",null,"Green","Amber","Red","No Response","No Compliance","Partial Compliance","Full Compliance","No Response","Validation"]
[null,1,"Governance and Leadership",{"$f":"COUNTIFS(Data!$D$1:$D$49,Calc!C6,Data!$C$1:$C$49,Calc!B6)","v":4},{"$f":"COUNTIFS(Data!$D$1:$D$49,Calc!$C6,Data!$C$1:$C$49,Calc!$B6,Data!$I$1:$I$49,Calc!E$4)","v":0},{"$f":"COUNTIFS(Data!$D$1:$D$49,Calc!$C6,Data!$C$1:$C$49,Calc!$B6,Data!$I$1:$I$49,Calc!F$4)","v":0},{"$f":"COUNTIFS(Data!$D$1:$D$49,Calc!$C6,Data!$C$1:$C$49,Calc!$B6,Data!$I$1:$I$49,Calc!G$4)","v":0},{"$f":"COUNTIFS(Data!$D$1:$D$49,Calc!$C6,Data!$C$1:$C$49,Calc!$B6,Data!$I$1:$I$49,Calc!H$4)","v":4},{"$f":"G6/$D6","v":0},{"$f":"F6/$D6","v":0},{"$f":"E6/$D6","v":0},{"$f":"H6/$D6","v":1},{"$f":"SUM(I6:L6)","v":1},null,{"$f":"COUNTIFS(Data!$D$1:$D$49,Calc!$C6,Data!$C$1:$C$49,Calc!$B6,Data!$J$1:$J$49,Calc!O$4)","v":0},{"$f":"COUNTIFS(Data!$D$1:$D$49,Calc!$C6,Data!$C$1:$C$49,Calc!$B6,Data!$J$1:$J$49,Calc!P$4)","v":0},{"$f":"COUNTIFS(Data!$D$1:$D$49,Calc!$C6,Data!$C$1:$C$49,Calc!$B6,Data!$J$1:$J$49,Calc!Q$4)","v":0},{"$f":"COUNTIFS(Data!$D$1:$D$49,Calc!$C6,Data!$C$1:$C$49,Calc!$B6,Data!$J$1:$J$49,Calc!R$4)","v":4},{"$f":"Q6/$D6","v":0},{"$f":"P6/$D6","v":0},{"$f":"O6/$D6","v":0},{"$f":"R6/$D6","v":1},{"$f":"SUM(S6:V6)","v":1}]
[null,1,"Monitoring and Agreeing Plans",{"$f":"COUNTIFS(Data!$D$1:$D$49,Calc!C7,Data!$C$1:$C$49,Calc!B7)","v":2},{"$f":"COUNTIFS(Data!$D$1:$D$49,Calc!$C7,Data!$C$1:$C$49,Calc!$B7,Data!$I$1:$I$49,Calc!E$4)","v":0},{"$f":"COUNTIFS(Data!$D$1:$D$49,Calc!$C7,Data!$C$1:$C$49,Calc!$B7,Data!$I$1:$I$49,Calc!F$4)","v":0},{"$f":"COUNTIFS(Data!$D$1:$D$49,Calc!$C7,Data!$C$1:$C$49,Calc!$B7,Data!$I$1:$I$49,Calc!G$4)","v":0},{"$f":"COUNTIFS(Data!$D$1:$D$49,Calc!$C7,Data!$C$1:$C$49,Calc!$B7,Data!$I$1:$I$49,Calc!H$4)","v":2},{"$f":"G7/$D7","v":0},{"$f":"F7/$D7","v":0},{"$f":"E7/$D7","v":0},{"$f":"H7/$D7","v":1},1,null,{"$f":"COUNTIFS(Data!$D$1:$D$49,Calc!$C7,Data!$C$1:$C$49,Calc!$B7,Data!$J$1:$J$49,Calc!O$4)","v":0},{"$f":"COUNTIFS(Data!$D$1:$D$49,Calc!$C7,Data!$C$1:$C$49,Calc!$B7,Data!$J$1:$J$49,Calc!P$4)","v":0},{"$f":"COUNTIFS(Data!$D$1:$D$49,Calc!$C7,Data!$C$1:$C$49,Calc!$B7,Data!$J$1:$J$49,Calc!Q$4)","v":0},{"$f":"COUNTIFS(Data!$D$1:$D$49,Calc!$C7,Data!$C$1:$C$49,Calc!$B7,Data!$J$1:$J$49,Calc!R$4)","v":2},{"$f":"Q7/$D7","v":0},{"$f":"P7/$D7","v":0},{"$f":"O7/$D7","v":0},{"$f":"R7/$D7","v":1},1]
[null,1,"Resourcing Joint Arrangements",{"$f":"COUNTIFS(Data!$D$1:$D$49,Calc!C8,Data!$C$1:$C$49,Calc!B8)","v":2},{"$f":"COUNTIFS(Data!$D$1:$D$49,Calc!$C8,Data!$C$1:$C$49,Calc!$B8,Data!$I$1:$I$49,Calc!E$4)","v":0},{"$f":"COUNTIFS(Data!$D$1:$D$49,Calc!$C8,Data!$C$1:$C$49,Calc!$B8,Data!$I$1:$I$49,Calc!F$4)","v":0},{"$f":"COUNTIFS(Data!$D$1:$D$49,Calc!$C8,Data!$C$1:$C$49,Calc!$B8,Data!$I$1:$I$49,Calc!G$4)","v":0},{"$f":"COUNTIFS(Data!$D$1:$D$49,Calc!$C8,Data!$C$1:$C$49,Calc!$B8,Data!$I$1:$I$49,Calc!H$4)","v":2},0,0,0,1,1,null,{"$f":"COUNTIFS(Data!$D$1:$D$49,Calc!$C8,Data!$C$1:$C$49,Calc!$B8,Data!$J$1:$J$49,Calc!O$4)","v":0},{"$f":"COUNTIFS(Data!$D$1:$D$49,Calc!$C8,Data!$C$1:$C$49,Calc!$B8,Data!$J$1:$J$49,Calc!P$4)","v":0},{"$f":"COUNTIFS(Data!$D$1:$D$49,Calc!$C8,Data!$C$1:$C$49,Calc!$B8,Data!$J$1:$J$49,Calc!Q$4)","v":0},{"$f":"COUNTIFS(Data!$D$1:$D$49,Calc!$C8,Data!$C$1:$C$49,Calc!$B8,Data!$J$1:$J$49,Calc!R$4)","v":2},0,0,0,1,1]
[null,1,"Thresholds and Eligibility Criteria",{"$f":"COUNTIFS(Data!$D$1:$D$49,Calc!C9,Data!$C$1:$C$49,Calc!B9)","v":2},{"$f":"COUNTIFS(Data!$D$1:$D$49,Calc!$C9,Data!$C$1:$C$49,Calc!$B9,Data!$I$1:$I$49,Calc!E$4)","v":0},{"$f":"COUNTIFS(Data!$D$1:$D$49,Calc!$C9,Data!$C$1:$C$49,Calc!$B9,Data!$I$1:$I$49,Calc!F$4)","v":0},{"$f":"COUNTIFS(Data!$D$1:$D$49,Calc!$C9,Data!$C$1:$C$49,Calc!$B9,Data!$I$1:$I$49,Calc!G$4)","v":0},{"$f":"COUNTIFS(Data!$D$1:$D$49,Calc!$C9,Data!$C$1:$C$49,Calc!$B9,Data!$I$1:$I$49,Calc!H$4)","v":2},0,0,0,1,1,null,{"$f":"COUNTIFS(Data!$D$1:$D$49,Calc!$C9,Data!$C$1:$C$49,Calc!$B9,Data!$J$1:$J$49,Calc!O$4)","v":0},{"$f":"COUNTIFS(Data!$D$1:$D$49,Calc!$C9,Data!$C$1:$C$49,Calc!$B9,Data!$J$1:$J$49,Calc!P$4)","v":0},{"$f":"COUNTIFS(Data!$D$1:$D$49,Calc!$C9,Data!$C$1:$C$49,Calc!$B9,Data!$J$1:$J$49,Calc!Q$4)","v":0},{"$f":"COUNTIFS(Data!$D$1:$D$49,Calc!$C9,Data!$C$1:$C$49,Calc!$B9,Data!$J$1:$J$49,Calc!R$4)","v":2},0,0,0,1,1]
[null,2,"Working Together",{"$f":"COUNTIFS(Data!$D$1:$D$49,Calc!C10,Data!$C$1:$C$49,Calc!B10)","v":4},{"$f":"COUNTIFS(Data!$D$1:$D$49,Calc!$C10,Data!$C$1:$C$49,Calc!$B10,Data!$I$1:$I$49,Calc!E$4)","v":0},{"$f":"COUNTIFS(Data!$D$1:$D$49,Calc!$C10,Data!$C$1:$C$49,Calc!$B10,Data!$I$1:$I$49,Calc!F$4)","v":0},{"$f":"COUNTIFS(Data!$D$1:$D$49,Calc!$C10,Data!$C$1:$C$49,Calc!$B10,Data!$I$1:$I$49,Calc!G$4)","v":0},{"$f":"COUNTIFS(Data!$D$1:$D$49,Calc!$C10,Data!$C$1:$C$49,Calc!$B10,Data!$I$1:$I$49,Calc!H$4)","v":4},0,0,0,1,1,null,{"$f":"COUNTIFS(Data!$D$1:$D$49,Calc!$C10,Data!$C$1:$C$49,Calc!$B10,Data!$J$1:$J$49,Calc!O$4)","v":0},{"$f":"COUNTIFS(Data!$D$1:$D$49,Calc!$C10,Data!$C$1:$C$49,Calc!$B10,Data!$J$1:$J$49,Calc!P$4)","v":0},{"$f":"COUNTIFS(Data!$D$1:$D$49,Calc!$C10,Data!$C$1:$C$49,Calc!$B10,Data!$J$1:$J$49,Calc!Q$4)","v":0},{"$f":"COUNTIFS(Data!$D$1:$D$49,Calc!$C10,Data!$C$1:$C$49,Calc!$B10,Data!$J$1:$J$49,Calc!R$4)","v":4},0,0,0,1,1]
{"$rows_left_out":20}
{"sheet":"LA - mapping","index":3,"n_rows":155,"n_cols":9,"rows_kept":155,"cut":false,"hidden":true,"merged":[]}
[]
[]
[]
[]
[null,"Audit 1 and 2 response","Mark",null,"Trend",null,"Combined","Region","Council"]
[null,"Please Select",0,null,"Please Select",null,"East - Bedford","East","Bedford"]
[null,"No Compliance: Not started. ",1,null,"Complete at 2nd Audit",null,"East - Cambridgeshire","East","Cambridgeshire"]
[null,"Partially Achieved: Some Progress/Implemented in some areas",2,null,"Improvement",null,"East - Central Bedfordshire","East","Central Bedfordshire"]
[null,"Full Compliance: Fully Achieved/Implemented",3,null,"No Change",null,"East - Essex","East","Essex"]
[null,null,null,null,"Decrease",null,"East - Hertfordshire","East","Hertfordshire"]
{"$rows_left_out":146}
{"sheet":"Summary SC","index":4,"n_rows":213,"n_cols":14,"rows_kept":213,"cut":false,"hidden":false,"merged":[[1,3,1,17],[4,8,4,10],[5,8,5,10]]}
[]
[null,null,null,"ENGAGEMENT AND PARTICIPATION AUDIT TOOL"]
[]
[]
[null,null,null,null,null,null,null,"REGION"]
[null,null,null,null,null,null,null,"LOCAL AUTHORITY"]
[]
[]
[]
[]
{"$rows_left_out":204}
{"sheet":"1. Leadership","index":5,"n_rows":50,"n_cols":10,"rows_kept":50,"cut":false,"hidden":false,"merged":[]}
[]
[null,null,null,"1. LEADERSHIP"]
[]
[null,null,null,"Governance and Leadership"]
[]
[null,null,null,"Prompts for Implementation","Key Indicators / Evidence","LA Named Lead","1st Audit RAG Rating: DD/MM/YY","2nd Audit RAG Rating: DD/MM/YY","Trend","Comments/Evidence"]
[null,null,null,"Do senior leaders and managers have a sound understanding of the key duties in the Children and Families Act 2014 as they relate to social care?","SEND champions are appointed within LAs and CCGs to raise the profile of SEND\n\nThe local SEND strategy group includes representatives linked to social care, virtual school heads and parent carers\n\nThe SEND Board, Social Care Board and Leadership meetings are influenced and supported by SEND champions and SEND strategy groups\n",null,"Please Select","Please Select","Please Select"]
[null,null,null,"Have the social care strategic managers worked with their  strategic partners to develop and agree a multiagency SEND strategy and implementation plan which clearly defines the strategic vision, objectives and outcomes that partners will work towards?","There is a multiagency SEND strategy and implementation plan signed off by social care and all other partners\n\nSocial care is part of the strategic partnership group which oversees the implementation and review of the plan\n\nThere is a clear set of performance measures that demonstrate progress towards achieving key social care related outcomes with the SEND strategy\n",null,"Please Select","Please Select","Please Select"]
[null,null,null,"How has the LA responded to ensuring a joined up approach to support for 0-25 age range across children's and adults' social care within the LA (with particular focus on promoting effective transitions, including Preparation for Adulthood)?","There are 0-25 social care and SEND strategies in place. \n\nProcesses are in place to ensure transition assessments under the Care Act 2014 are aligned with the EHC planning process\n\nThere is effective communication between teams focussed on supporting 0-25 year olds who are eligible for either SEN Support or an EHC plan",null,"Please Select","Please Select","Please Select"]
[null,null,null,"To what extent are social care leaders aware of their areas of strengths and areas for development in relation to SEND?","Peer review occurs internally and regionally\n\nFeedback from parents is collated and used \n\nThere is a process in place for sharing the audit tool and gaining triangulated feedback on self assessment\n",null,"Please Select","Please Select","Please Select"]
{"$rows_left_out":41}
{"sheet":"2. Joint Arrangements","index":6,"n_rows":51,"n_cols":10,"rows_kept":51,"cut":false,"hidden":false,"merged":[]}
[]
[null,null,null,"2. JOINT ARRANGEMENTS"]
[]
[null,null,null,"Working Together"]
[]
[null,null,null,"Prompts for Implementation","Key Indicators / Evidence","LA Named Lead","1st Audit RAG Rating: DD/MM/YY","2nd Audit RAG Rating: DD/MM/YY","Trend","Comments/Evidence"]
[null,null,null,"Are there clear decision-making structures which allow social care partners to agree the outcomes sought and services required to achieve them?\n","There are clear multi-agency protocols in place to support oversight and decision making, joint commissioning, pathways and threshold documents",null,"Please Select","Please Select","Please Select"]
[null,null,null,"Are there agreements in place about how all social care services, including children's and adults', contribute to the SEN agenda?","There is infrastucture in place to allow for joint working between SEN and Children's and Adults' social care teams such as a 0-25 service model\n\nThere are clear links between and understanding of roles and repsonsibilities across SEN and all social care teams (e.g. Early Help, CiN, LAC, CP)\n\nThere are agreed links between children's and adults' services and clear protocols for engagement and information sharing \n",null,"Please Select","Please Select","Please Select"]
[null,null,null,"Are the Early Help processes and SEND processes clearly aligned?  ","There are processes in place for the effective assessment of the needs of individual children who may benefit from early help services\n\nEarly Help assessments are informed by - or inform - an EHC needs assessment. The lead professional ensures information relevant to both assessment processes is shared\n",null,"Please Select","Please Select","Please Select"]
[null,null,null,"Are there arrangements in place for the LA to quality assure and performance manage its in-house social care functions against meeting the statutory duties of the SEND Code of Practice?","Requests for social care advice and information are responded to within 6 weeks of the request\n\nSocial care practitioners are involved in multi-agency decision making and sign off processes\n",null,"Please Select","Please Select","Please Select"]
{"$rows_left_out":42}
{"sheet":"3. Commissioning","index":7,"n_rows":52,"n_cols":10,"rows_kept":52,"cut":false,"hidden":false,"merged":[]}
[]
[null,null,null,"3. COMMISSIONING"]
[]
[null,null,null,"Assessing Local Need"]
[]
[null,null,null,"Prompts for Implementation","Key Indicators / Evidence","LA Named Lead","1st Audit RAG Rating: DD/MM/YY","2nd Audit RAG Rating: DD/MM/YY","Trend","Comments/Evidence"]
[null,null,null,"Are local and national data sets being used (e.g. https://www.gov.uk/guidance/phe-data-and-analysis-tools#child-and-maternal-health) to understand local needs?","There are processes in place to collate and analyse local and national data to understand local need and inform commissioning processes\n\nLeaders and managers meet together regularly, share information and jointly commission services\n",null,"Please Select","Please Select","Please Select"]
[null,null,null,"Does the data available provide assurance that local services are sufficient to meet need as required by section 27(2) of the Children and Familes Act 2014?","Data are collected from a range of local sources including feedback from the local offer and EHC plans to inform local area gap analysis \n\nThere are effective joint commissioning arrangements in place to deliver improved services and outcomes",null,"Please Select","Please Select","Please Select"]
[null,null,null,"Is there a process in place for reviewing the experiences and outcomes of families/children and young people whose needs require multiple commissioning and services?\n","Personalised joint commissioning for complex cases is informed by regular reviews and monitoring of progress towards outcomes",null,"Please Select","Please Select","Please Select"]
[]
{"$rows_left_out":43}
{"sheet":"4. EHC Plan","index":8,"n_rows":43,"n_cols":10,"rows_kept":43,"cut":false,"hidden":false,"merged":[]}
[]
[null,null,null,"4. EHC PLAN"]
[]
[null,null,null,"SEN Support and Early Help"]
[]
[null,null,null,"Prompts for Implementation","Key Indicators / Evidence","LA Named Lead","1st Audit RAG Rating: DD/MM/YY","2nd Audit RAG Rating: DD/MM/YY","Trend","Comments/Evidence"]
[null,null,null,"Are the children's workforce across education, health and care supported to recognise the needs of children and families who may require early help?","Practitioners across all services share a common purpose to identify and support those who have special educational needs and/or disabilities as soon as possible\n\nPractitioners understand local thresholds for early help and know when and how to make a referral\n\nThere is high quality training, information and guidance to inform processes and establish consistency in assessment\n",null,"Please Select","Please Select","Please Select"]
[null,null,null,"Is there a clear process in place to ensure that where children and young people are engaged with SEN support there is a holistic approach to planning which includes health and social care needs?","Early identification training for school and college staff, EHC plan coordinators and frontline practitioners enables them to support early identification of social care needs\n\nThe local area’s ‘early help’ assessment process is a good example of joint working across the education, health and care workforce\n\nThe SEN support planning process is hoslitic and includes information relating to support across education, health and care where relevant\n",null,"Please Select","Please Select","Please Select"]
[null,null,null,"Do early help practitioners understand their role and responsibilities in relation to SEN support and EHC needs assessment and planning processes?","High quality training for early help practitioners enables them to contribute meaningfully to SEN support planning and education, health and care needs assessment and planning\n\nThe local offer supports practitioners and families to know how to access appropriate pathways and support from universal services, short breaks, early help and children's and adults' social care",null,"Please Select","Please Select","Please Select"]
[null,null,null,"Is there a clear process for sharing relevant information related to social care needs as part of assessment and planning processes?","Early help practitioners are supported through high quality training to help them to identify information relevant to a child or young person's SEN\n\nThere are clear protocols in place regarding when, how and with whom to share information. These are aligned with other information sharing processes across children’s social care                                                    \n",null,"Please Select","Please Select","Please Select"]
{"$rows_left_out":34}
{"sheet":"5. Co-Production","index":9,"n_rows":19,"n_cols":10,"rows_kept":19,"cut":false,"hidden":false,"merged":[]}
[]
[null,null,null,"5. CO-PRODUCTION"]
[]
[null,null,null,"Working in Partnership With Children and Families"]
[]
[null,null,null,"Prompts for Implementation","Key Indicators / Evidence","LA Named Lead","1st Audit RAG Rating: DD/MM/YY","2nd Audit RAG Rating: DD/MM/YY","Trend","Comments/Evidence"]
[null,null,null,"Are children, young people and parents effectively involved in decisions at both a strategic and individual level?","Disabled children, those with SEN and their parents are consistently provided with the information, advice and support they need to participate in discussions and decisions about individual social care support and local provision\n\nSection 19 principles are embedded in practice across children's and adults' social care services\n",null,"Please Select","Please Select","Please Select"]
[null,null,null,"Are thresholds and eligibility criteria for children's social care clear and applied consistently?","Threshold documents are transparent and explain in clear 'everyday language' how services are allocated on the basis of need\n\nThresholds are applied through careful assessment of need using a whole family approach, looking at the child's level of need in the family context\n",null,"Please Select","Please Select","Please Select"]
[null,null,null,"Are comments from children, young people and parents about the local offer used to improve the range and responsiveness of services and support?","There is a process in place that ensures feedback and comments on the local offer in relation to social care, and analysis across individual EHC plans informs planning and  commissioning of services\n\nThe section 19 principles and person-centred approaches are embedded in practice in relation to assessment and planning\n",null,"Please Select","Please Select","Please Select"]
[]
{"$rows_left_out":9}