{"text_format":"1","workbook":"xlsx","n_sheets":11,"sheets":["Information","Data","Calc","LA - mapping","Summary LA","1. Children's Social Care","2. Adult Social Care","3. Health","4. Early Years","5. Schools","6. Post 16 Options"],"not_rendered":{"charts":16,"images":5,"macros":1,"external_links":0,"defined_names":3,"comments":0,"pivot_tables":0},"unopened":[],"bounds":{"document_bytes":16777216,"sheet_cells":100000,"rows_first":2000,"rows_last":500,"rows_between":2000,"halvings":0,"cell_chars":16384,"cell_head_chars":4096},"cells_cut":0,"cells_raw":0,"read":"whole","date_system":"1900"}

{"sheet":"Information","index":0,"n_rows":21,"n_cols":4,"rows_kept":21,"cut":false,"hidden":false,"merged":[]}
[]
[]
[]
[]
[null,null,null,"INTRODUCTION"]
[]
[]
[null,null,null,"The Children and Families Act 2014"]
[]
[null,null,null,"The Children and Families Act is a statutory framework that supports joint working across local areas to support the best possible outcomes for children and young people with SEND in a participative and person centred way."]
{"$rows_left_out":12}
{"sheet":"Data","index":1,"n_rows":60,"n_cols":10,"rows_kept":60,"cut":false,"hidden":true,"merged":[]}
["m1","Section","Section_ID","Sub-Section","SS_ID","Q","Audit1","Audit2","Audit1_Score","Audit2_Score"]
[null,"1. Children's Social Care",1,"CSC",1.1000000000000001,1,{"$f":"'1. Children''s Social Care'!G6","v":"Please Select"},{"$f":"'1. Children''s Social Care'!H6","v":"Please Select"},{"$f":"VLOOKUP(G2,'LA - mapping'!$B$6:$C$9,2,0)","v":0},{"$f":"VLOOKUP(H2,'LA - mapping'!$B$6:$C$9,2,0)","v":0}]
[null,"1. Children's Social Care",1,"CSC",1.1000000000000001,2,{"$f":"'1. Children''s Social Care'!G7","v":"Please Select"},{"$f":"'1. Children''s Social Care'!H7","v":"Please Select"},{"$f":"VLOOKUP(G3,'LA - mapping'!$B$6:$C$9,2,0)","v":0},{"$f":"VLOOKUP(H3,'LA - mapping'!$B$6:$C$9,2,0)","v":0}]
[null,"1. Children's Social Care",1,"CSC",1.1000000000000001,3,{"$f":"'1. Children''s Social Care'!G8","v":"Please Select"},{"$f":"'1. Children''s Social Care'!H8","v":"Please Select"},{"$f":"VLOOKUP(G4,'LA - mapping'!$B$6:$C$9,2,0)","v":0},{"$f":"VLOOKUP(H4,'LA - mapping'!$B$6:$C$9,2,0)","v":0}]
[null,"1. Children's Social Care",1,"CSC",1.1000000000000001,4,{"$f":"'1. Children''s Social Care'!G9","v":"Please Select"},{"$f":"'1. Children''s Social Care'!H9","v":"Please Select"},{"$f":"VLOOKUP(G5,'LA - mapping'!$B$6:$C$9,2,0)","v":0},{"$f":"VLOOKUP(H5,'LA - mapping'!$B$6:$C$9,2,0)","v":0}]
[null,"1. Children's Social Care",1,"CSC",1.1000000000000001,5,{"$f":"'1. Children''s Social Care'!G10","v":"Please Select"},{"$f":"'1. Children''s Social Care'!H10","v":"Please Select"},{"$f":"VLOOKUP(G6,'LA - mapping'!$B$6:$C$9,2,0)","v":0},{"$f":"VLOOKUP(H6,'LA - mapping'!$B$6:$C$9,2,0)","v":0}]
[null,"1. Children's Social Care",1,"CSC",1.1000000000000001,6,{"$f":"'1. Children''s Social Care'!G11","v":"Please Select"},{"$f":"'1. Children''s Social Care'!H11","v":"Please Select"},{"$f":"VLOOKUP(G7,'LA - mapping'!$B$6:$C$9,2,0)","v":0},{"$f":"VLOOKUP(H7,'LA - mapping'!$B$6:$C$9,2,0)","v":0}]
[null,"1. Children's Social Care",1,"CSC",1.1000000000000001,7,{"$f":"'1. Children''s Social Care'!G12","v":"Please Select"},{"$f":"'1. Children''s Social Care'!H12","v":"Please Select"},{"$f":"VLOOKUP(G8,'LA - mapping'!$B$6:$C$9,2,0)","v":0},{"$f":"VLOOKUP(H8,'LA - mapping'!$B$6:$C$9,2,0)","v":0}]
[null,"1. Children's Social Care",1,"CSC",1.1000000000000001,8,{"$f":"'1. Children''s Social Care'!G13","v":"Please Select"},{"$f":"'1. Children''s Social Care'!H13","v":"Please Select"},{"$f":"VLOOKUP(G9,'LA - mapping'!$B$6:$C$9,2,0)","v":0},{"$f":"VLOOKUP(H9,'LA - mapping'!$B$6:$C$9,2,0)","v":0}]
[null,"2. Adult Social Care",2,"ASC",2.1,1,{"$f":"'2. Adult Social Care'!G6","v":"Please Select"},{"$f":"'2. Adult Social Care'!H6","v":"Please Select"},{"$f":"VLOOKUP(G10,'LA - mapping'!$B$6:$C$9,2,0)","v":0},{"$f":"VLOOKUP(H10,'LA - mapping'!$B$6:$C$9,2,0)","v":0}]
{"$rows_left_out":51}
{"sheet":"Calc","index":2,"n_rows":21,"n_cols":23,"rows_kept":21,"cut":false,"hidden":true,"merged":[]}
[]
[]
[null,null,null,null,"1st AUDIT: SCORE",null,null,null,"1st AUDIT: PERCENTAGE",null,null,null,null,null,"2nd AUDIT: SCORE",null,null,null,"2nd AUDIT: PERCENTAGE"]
[null,null,null,null,3,2,1,0,null,null,null,null,null,null,3,2,1,0]
[null,"Section_ID","Sub-Section","No of Qs","Green","Amber","Red","No Response","No Compliance","Partial Compliance","Full Compliance","No Response","Validation",null,"Green","Amber","Red","No Response","No Compliance","Partial Compliance","Full Compliance","No Response","Validation"]
[null,1.1000000000000001,"CSC",{"$f":"COUNTIF(Data!$E$2:$E$99,Calc!B6)","v":8},{"$f":"COUNTIFS(Data!$E:$E,Calc!$B6,Data!$I:$I,Calc!E$4)","v":0},{"$f":"COUNTIFS(Data!$E:$E,Calc!$B6,Data!$I:$I,Calc!F$4)","v":0},{"$f":"COUNTIFS(Data!$E:$E,Calc!$B6,Data!$I:$I,Calc!G$4)","v":0},{"$f":"COUNTIFS(Data!$E:$E,Calc!$B6,Data!$I:$I,Calc!H$4)","v":8},{"$f":"G6/$D6","v":0},{"$f":"F6/$D6","v":0},{"$f":"E6/$D6","v":0},{"$f":"H6/$D6","v":1},{"$f":"SUM(I6:L6)","v":1},null,{"$f":"COUNTIFS(Data!$E:$E,Calc!$B6,Data!$J:$J,Calc!O$4)","v":0},{"$f":"COUNTIFS(Data!$E:$E,Calc!$B6,Data!$J:$J,Calc!P$4)","v":0},{"$f":"COUNTIFS(Data!$E:$E,Calc!$B6,Data!$J:$J,Calc!Q$4)","v":0},{"$f":"COUNTIFS(Data!$E:$E,Calc!$B6,Data!$J:$J,Calc!R$4)","v":8},{"$f":"Q6/$D6","v":0},{"$f":"P6/$D6","v":0},{"$f":"O6/$D6","v":0},{"$f":"R6/$D6","v":1},{"$f":"SUM(S6:V6)","v":1}]
[null,2.1,"ASC",{"$f":"COUNTIF(Data!$E$2:$E$99,Calc!B7)","v":9}]
[null,3.1,"H",{"$f":"COUNTIF(Data!$E$2:$E$99,Calc!B8)","v":12}]
[null,4.0999999999999996,"EY",{"$f":"COUNTIF(Data!$E$2:$E$99,Calc!B9)","v":7}]
[null,5.0999999999999996,"S",{"$f":"COUNTIF(Data!$E$2:$E$99,Calc!B10)","v":13}]
{"$rows_left_out":12}
{"sheet":"LA - mapping","index":3,"n_rows":155,"n_cols":9,"rows_kept":155,"cut":false,"hidden":true,"merged":[]}
[]
[]
[]
[]
[null,"Audit 1 and 2 response","Mark",null,"Trend",null,"Combined","Region","Council"]
[null,"Please Select",0,null,"Please Select",null,"East - Bedford","East","Bedford"]
[null,"No Compliance: Not started. ",1,null,"Complete at 2nd Audit",null,"East - Cambridgeshire","East","Cambridgeshire"]
[null,"Partially Achieved: Some Progress/Implemented in some areas",2,null,"Improvement",null,"East - Central Bedfordshire","East","Central Bedfordshire"]
[null,"Full Compliance: Fully Achieved/Implemented",3,null,"No Change",null,"East - Essex","East","Essex"]
[null,null,null,null,"Decrease",null,"East - Hertfordshire","East","Hertfordshire"]
{"$rows_left_out":146}
{"sheet":"Summary LA","index":4,"n_rows":175,"n_cols":14,"rows_kept":175,"cut":false,"hidden":false,"merged":[[1,3,1,17],[4,8,4,10],[5,8,5,10]]}
[]
[null,null,null,"PREPARATION AND TRANSITION TO ADULTHOOD AUDIT TOOL"]
[]
[]
[null,null,null,null,null,null,null,"REGION"]
[null,null,null,null,null,null,null,"LOCAL AUTHORITY"]
[]
[]
[]
[]
{"$rows_left_out":166}
{"sheet":"1. Children's Social Care","index":5,"n_rows":17,"n_cols":10,"rows_kept":17,"cut":false,"hidden":false,"merged":[]}
[]
[null,null,null,"1.Children's Social Care"]
[]
[]
[null,null,null,"Prompts for Implementation","Key Indicators / Evidence","LA Named Lead","1st Audit RAG Rating: DD/MM/YY","2nd Audit RAG Rating: DD/MM/YY","Trend","Comments/Evidence"]
[null,null,null,"Does the local authority have good information and monitoring systems to allow children’s social care to forecast demand for support across PfA outcome areas?","There is an up to date database that tracks and monitors the needs of children as they move into adult life. The local PfA board is responsible for collecting and analysing the data to inform commissioning \n",null,"Please Select","Please Select","Please Select"]
[null,null,null,"Are EHC planning and review processes aligned with assessment and planning processes across health and social care for children’s and adults’ services?\n","Looked After Children and Safeguarding processes and Transition assessments under the Care Act are integrated with SEND statutory requirements ",null,"Please Select","Please Select","Please Select"]
[null,null,null,"Does the Local Offer have a well-developed Preparing for Adulthood section that clearly identifies the social care support and provision available for young people aged 14+?","Young people and parent/carers can easily use the Local Offer to find information they need about the PfA life outcomes. Local Offer peer reviews consider the quality of PfA outcomes as part of this process \n",null,"Please Select","Please Select","Please Select"]
[null,null,null,"Does children’s social care work in partnership with education, health, adult social care, schools,  housing,  employment and post-16 providers so there is a consistent vision for young people as they move into adult life with good outcomes?\n","There is a multi agency group with a shared vision articulated in a strategic  plan that focusses on PfA",null,"Please Select","Please Select","Please Select"]
[null,null,null,"Have Social Care staff  had relevant training so they know what helps disabled young people achieve good life outcomes including those with the most complex needs who don't use words to speak?\n","The workforce development programme targets all relevant groups, including Family Support workers, Personal Assistants, Community Workers, review officers and any children's multi-agency practitioners                                                                There is an ongoing programme of CPD to ensure that there is a clear understanding of the evidence base of how to achieve PfA outcomes. There are opportunities for children and adult social care practitioners to work together to develop an understanding of a 0-25 approach",null,"Please Select","Please Select","Please Select"]
{"$rows_left_out":8}
{"sheet":"2. Adult Social Care","index":6,"n_rows":24,"n_cols":10,"rows_kept":24,"cut":false,"hidden":false,"merged":[]}
[]
[null,null,null,"2. ADULT SOCIAL CARE"]
[]
[]
[null,null,null,"Prompts for Implementation","Key Indicators / Evidence","LA Named Lead","1st Audit RAG Rating: DD/MM/YY","2nd Audit RAG Rating: DD/MM/YY","Trend","Comments/Evidence"]
[null,null,null,"Are there partnership arrangements in place across education, health and children and adult social care for 18-25 year olds that support joint working and understanding of PfA?","There is a strategic group that oversees the ongoing development of joint working/workforce development and joint commissioning for 0-25. There is a clear pathway understood by all that shows how young people are supported by each agency in an integrated way.",null,"Please Select","Please Select","Please Select"]
[null,null,null,"Do all adult social care staff have a  clear and shared understanding of Preparing for Adulthood outcomes (Employment, Friends and  Relationships and Community participation, Independent Living, Good Health) and the evidence of what works to achieve them?\n","There is an ongoing programme of CDP to ensure that there is a clear understanding of the evidence base of how to achieve PfA outcomes. There are opportunities for children and adult social care practitioners to work together to develop an understanding of a 0-25 approach ",null,"Please Select","Please Select","Please Select"]
[null,null,null,"Are there arrangements in place to ensure that young people and their families understand adult social care eligibility from year 9? Is there a clear pathway for young people who will not be eligible for adult social care?","There is a clear and accessible description of the adult social care offer and eligibility criteria for families on the Local Offer  and which, young people and families receive at the Year 9 review.  There is a clear and accessible description of support available to young people who will not meet the eligibility criteria for adult social care.",null,"Please Select","Please Select","Please Select"]
[null,null,null,"Does Joint commissioning take place across adult and children services?","There are robust arrangements to jointly commission services for individual children and young people.  There is a mechanism for developing strategic joint commissioning \n",null,"Please Select","Please Select","Please Select"]
[null,null,null,"Are there good mechanisms for identifying children and young people who are likely to be in need of adult social care?","There is a mechanism in place to identify and plan across children and adult social care for those young people eligible for adult social care support and provision that supports an integrated transition plan from year 9\n",null,"Please Select","Please Select","Please Select"]
{"$rows_left_out":15}
{"sheet":"3. Health","index":7,"n_rows":47,"n_cols":10,"rows_kept":47,"cut":false,"hidden":false,"merged":[]}
[]
[null,null,null,"3. HEALTH"]
[]
[]
[null,null,null,"Prompts for Implementation","Key Indicators / Evidence","LA Named Lead","1st Audit RAG Rating: DD/MM/YY","2nd Audit RAG Rating: DD/MM/YY","Trend","Comments/Evidence"]
[null,null,null,"Is there is a clear system in place to identify the views and needs of young people and the views and needs of parent/carers from 14+ that inform: adults’ services, the Joint Strategic Needs Assessment (JSNA), the Joint Health and Wellbeing Strategy and commissioning to improve outcomes for young people moving into adulthood?\n","Parent- carers and young people's views are represented on the Health and Wellbeing Board and there is a system for gathering the views of young people and families about the health services that are available locally.",null,"Please Select","Please Select","Please Select"]
[null,null,null,"Is there a system in place to offer personal health budgets to young people with long term health conditions and is there information available on the Local Offer?\n","Increase in number of young people  with personal health budgets and evidence of these supporting better outcomes.",null,"Please Select","Please Select","Please Select"]
[null,null,null,"Is there a joined up decision making process that lead to holistic packages across education and social care that enable young people with complex needs or behaviours that challenge to have personalised post-16 packages that lead to full adult lives?\n","The numbers of young people with integrated education and care packages increases over time. Feedback is obtained on the quality and impact of these arrangements.",null,"Please Select","Please Select","Please Select"]
[null,null,null,"Do young people with additional needs and long term conditions have a integrated  SEN support or EHC plan that includes a health element beyond 19? (for example a health action plan) Are there arrangements in place for community health services to contribute to EHC plans? Are there arrangements in place for CHC to contribute to plans?\n","over 75% of young people have a health action plan that is referred to by relevant support staff",null,"Please Select","Please Select","Please Select"]
[null,null,null,"Do young people continue to have their health needs met as they progress into adult life ","There is a system in place to ensure young people with learning disabilities are registered with their GP from 14 and offered an annual health check\n",null,"Please Select","Please Select","Please Select"]
{"$rows_left_out":38}
{"sheet":"4. Early Years","index":8,"n_rows":22,"n_cols":10,"rows_kept":22,"cut":false,"hidden":false,"merged":[]}
[]
[null,null,null,"4. EARLY YEARS"]
[]
[]
[null,null,null,"Prompts for Implementation","Key Indicators / Evidence","LA Named Lead","1st Audit RAG Rating: DD/MM/YY","2nd Audit RAG Rating: DD/MM/YY","Trend","Comments/Evidence"]
[null,null,null,"Are there arrangements in place to ensure that the early years workforce understands the PfA outcomes?","The outcomes in plans support children to develop friendships, independence, and early learning goals as well as supporting good health \n",null,"Please Select","Please Select","Please Select"]
[null,null,null,"Within the Early Years curriculum are there opportunities to have an understanding of the world of work?","Children are encouraged to think about work through play, resources (such as books), exploration and opportunities to hear from people doing different jobs, such as fire officers, nurses etc. \n",null,"Please Select","Please Select","Please Select"]
[null,null,null,"Do staff in Early Years settings support children to develop friendships and encourage inclusion that supports independence?\n","Staff encourage children to understand and  include their disabled peers (for example Circles of Friends) ",null,"Please Select","Please Select","Please Select"]
[null,null,null,"Is additional support used to enhance and encourage independence rather than create dependence? \n","All staff facilitate co-operative play and work to encourage independence ",null,"Please Select","Please Select","Please Select"]
[null,null,null,"Is support for children who have additional health needs discreet and delivered in a way that enhances independence and inclusion?","Therapies are integrated into curriculum activity. Children with complex needs have their needs met in an inclusive way, for example children requiring tube feeding remain in the canteen environment with the other children ",null,"Please Select","Please Select","Please Select"]
{"$rows_left_out":13}
{"sheet":"5. Schools","index":9,"n_rows":54,"n_cols":10,"rows_kept":54,"cut":false,"hidden":false,"merged":[]}
[]
[null,null,null,"5. SCHOOLS"]
[]
[]
[null,null,null,"Prompts for Implementation","Key Indicators / Evidence","LA Named Lead","1st Audit RAG Rating: DD/MM/YY","2nd Audit RAG Rating: DD/MM/YY","Trend","Comments/Evidence"]
[null,null,null,"Are Schools represented on the local authority's PfA strategic board.","There is representation of schools at meetings with a  feedback mechanism in place.\n",null,"Please Select","Please Select","Please Select"]
[null,null,null,"Are parents involved with supporting their young people to move into adulthood by receiving timely information, advice and guidance and support to navigate the system \n","Parent feedback indicates satisfaction through the Local Offer feedback mechanism and the parent carer forum ",null,"Please Select","Please Select","Please Select"]
[null,null,null,"Are all children and young people with SEND actively encouraged to participate and achieve in all aspects of school life to prepare them for adult life and increase their independence ","Through the audit of EHC plans it is clear that friendships and participation are planned for. There is evidence that young people with SEND are included in school trips and are represented on school forums.\n",null,"Please Select","Please Select","Please Select"]
[null,null,null,"Do local schools and colleges actively work with partners to ensure an understanding of how PfA outcomes should be embedded in the curriculum so young people have a smooth transition to post 16?\n","Schools and colleges work together to plan the curriculum from year 9 and  share best practice, for example Study Programmes ",null,"Please Select","Please Select","Please Select"]
[null,null,null,"Do teaching and support staff have access to and use, good quality information, advice and support which raises aspirations for adult life? \n","When questioned school staff know where to find relevant IASS",null,"Please Select","Please Select","Please Select"]
{"$rows_left_out":45}
{"sheet":"6. Post 16 Options","index":10,"n_rows":29,"n_cols":10,"rows_kept":29,"cut":false,"hidden":false,"merged":[]}
[]
[null,null,null,"6. POST 16 OPTIONS"]
[]
[]
[null,null,null,"Prompts for Implementation","Key Indicators / Evidence","LA Named Lead","1st Audit RAG Rating: DD/MM/YY","2nd Audit RAG Rating: DD/MM/YY","Trend","Comments/Evidence"]
[null,null,null,"Do post 16 providers work with schools and the LA to plan provision for all young people coming through the system?\n","There is a mechanism in place for key partners to use information from young people's plans to develop the future curriculum ",null,"Please Select","Please Select","Please Select"]
[null,null,null,"Do post 16 providers work with partners to ensure  there is a joined up, outcomes focused,  pathway for young people with SEN support/EHC plans with young people leaving school with SEN support and EHCP's that can be used effectively in post 16 provision?\n","Schools and colleges work together to plan the curriculum from year 9 and  share best practice, for example study programmes to ensure there is a clear pathway in place for young people with SEND. There is a local strategy in place for young people to experience college, for example taster days. ",null,"Please Select","Please Select","Please Select"]
[null,null,null,"Is there a clear understanding of the criteria that will be applied in relation to the retention of an EHC plan, across Education, Health and Care based on progress towards achieving PfA outcomes beyond 18?\n","The Local Offer clearly describes PfA pathways and how these can be implemented. More young people with plans are leaving education and going into work from age 19",null,"Please Select","Please Select","Please Select"]
[null,null,null,"Do post 16 providers work closely with the LA, the parent/carer forum and young people to develop the Preparation for Adulthood section of the Local Offer including the development of clear 14-25 pathways to positive life outcomes (employment;  independent living; good health and wellbeing; friends and relationships and community inclusion)?\n","The Local Offer has a clear and accessible PfA section and steps are taken to help people access information if needed",null,"Please Select","Please Select","Please Select"]
[null,null,null,"Do post 16 providers have a strong relationship with adult social care and health to work together to develop an integrated package of support that leads to fulfilling lives in the community?\n","There is a clear joint commissioning strategy in place with evidence of mutual understanding and positive working relationships between key professionals and agencies ",null,"Please Select","Please Select","Please Select"]
{"$rows_left_out":19}